program: Orca
programVersion: 5.0.2
elementType: O O O O N N C C C C C C C C C C C C C C C C C H H H H H H H H H H H H H H H H H H H H H H
charge: 0
multiplicity: 1
keywords: wb97x-d3
keywords: def2-TZVPP
keywords: def2/J RIJCOSX
keywords: DEFGRID2
keywords: scfconv7
keywords: smallprint printgap noloewdin
keywords: NOSOSCF
formula: C17H22N2O4
InChI: InChI=1/C17H22N2O4/c1-6-7-18-9-13(20)19(16(18)22)10-23-15(21)14-12(8-11(2)3)17(14,4)5/h1,8,12,14H,7,9-10H2,2-5H3
45 atoms
O  0.376253 1.000605 0.74032
O  -0.701727 2.2665 -0.770224
O  1.611771 0.220119 -2.176054
O  3.694596 0.09478 1.869748
N  2.493185 0.47484 -0.075031
N  4.13455 -1.002756 -0.108054
C  -3.083715 1.420202 1.178865
C  -3.223884 0.807468 -0.182692
C  -1.908825 0.681062 0.554261
C  -3.715004 0.746752 2.371916
C  -3.073345 2.924713 1.284506
C  -4.03591 -0.40161 -0.431431
C  -0.720462 1.406558 0.076702
C  -4.999666 -0.527854 -1.350174
C  -5.752976 -1.815172 -1.501805
C  -5.424428 0.552755 -2.297899
C  1.64479 1.52843 0.388604
C  2.403175 -0.091406 -1.318752
C  3.480932 -0.142026 0.701059
C  3.460913 -1.158044 -1.375749
C  5.062067 -1.987324 0.396227
C  4.40347 -3.199386 0.878942
C  3.869685 -4.202768 1.267902
H  -3.208176 1.533417 -0.988452
H  -1.692989 -0.280535 1.007359
H  -3.668733 -0.339956 2.317579
H  -3.210898 1.052503 3.290428
H  -4.765043 1.031857 2.460628
H  -4.090746 3.283278 1.451785
H  -2.46638 3.256933 2.128936
H  -2.702722 3.415809 0.386926
H  -3.822321 -1.259679 0.199625
H  -6.820248 -1.665706 -1.31888
H  -5.667609 -2.20245 -2.520435
H  -5.397781 -2.585017 -0.817116
H  -4.96405 1.518847 -2.101091
H  -5.191085 0.276495 -3.329582
H  -6.507637 0.689468 -2.255821
H  1.565523 2.294364 -0.379547
H  2.086737 1.968598 1.278797
H  2.993044 -2.141713 -1.479558
H  4.129735 -1.002554 -2.22362
H  5.656892 -1.541303 1.193341
H  5.760725 -2.24063 -0.402207
H  3.409223 -5.099336 1.618834
elementType: O N C H
totalener: -1071.54060037 hartree
nucrepener: 1901.01282160 hartree
electener: -2972.55342197 hartree
oneelecener: -5234.82153147 hartree
twoeener: 2262.26810949 hartree
cpcmener: -0.05344176 hartree
kineticenergy: 1066.85053637 hartree
xcener: -102.622478814272 hartree
chargesum: 0.0000000
charge: -0.279834 -0.479946 -0.476912 -0.512021 -0.108266 -0.171354 0.111901 0.042052 -0.139454 -0.266907 -0.275956 -0.289445 0.440666 -0.038253 -0.221201 -0.256100 0.059599 0.320954 0.407977 0.009434 -0.052878 -0.432776 0.061592 0.089228 0.096425 0.089561 0.099332 0.097863 0.098777 0.100745 0.091110 0.122298 0.094515 0.093521 0.088855 0.091926 0.099546 0.094042 0.143875 0.132957 0.128628 0.125939 0.136989 0.142897 0.288099
qa: -0.2798 -0.4799 -0.4769 -0.5120 -0.1083 -0.1714 0.1119 0.0421 -0.1395 -0.2669 -0.2760 -0.2894 0.4407 -0.0383 -0.2212 -0.2561 0.0596 0.3210 0.4080 0.0094 -0.0529 -0.4328 0.0616 0.0892 0.0964 0.0896 0.0993 0.0979 0.0988 0.1007 0.0911 0.1223 0.0945 0.0935 0.0889 0.0919 0.0995 0.0940 0.1439 0.1330 0.1286 0.1259 0.1370 0.1429 0.2881
va: 2.1105 2.0284 2.0350 2.0057 3.1292 3.1986 3.7029 3.7637 3.8435 3.9069 3.9084 3.8762 4.1550 3.7405 3.9226 3.9428 3.8737 4.1673 4.2904 3.9019 3.9048 3.7399 3.5781 1.0346 1.0363 1.0051 1.0021 1.0022 1.0002 0.9998 1.0160 1.0092 0.9963 0.9956 1.0087 1.0081 0.9960 0.9977 1.0173 1.0138 1.0046 1.0080 0.9991 0.9862 0.9448
dispcorr: -0.019938807 hartree
energy: -1071.560539177032
dipole: -35.69934 36.37678 0.67744 -0.52787 -1.07022 -1.59809 -0.41033 0.41857 0.00824
magnitude: 1.73576 au
magnitude: 4.41196 debye
