program: Orca
programVersion: 5.0.2
elementType: O O O O N N C C C C C C C C C C C C C C C C C H H H H H H H H H H H H H H H H H H H H H H
charge: 0
multiplicity: 1
keywords: wb97x-d3
keywords: def2-TZVPP
keywords: def2/J RIJCOSX
keywords: DEFGRID2
keywords: scfconv7
keywords: smallprint printgap noloewdin
keywords: NOSOSCF
formula: C17H22N2O4
InChI: InChI=1/C17H22N2O4/c1-6-7-18-9-13(20)19(16(18)22)10-23-15(21)14-12(8-11(2)3)17(14,4)5/h1,8,12,14H,7,9-10H2,2-5H3
45 atoms
O  0.210019 1.456995 1.194086
O  0.071104 -0.771162 1.344571
O  3.159068 -0.999096 1.892373
O  1.939388 2.166887 -1.149743
N  2.410178 0.785799 0.643165
N  3.374401 0.368142 -1.30563
C  -2.123617 0.236031 -0.886863
C  -2.667862 -0.661737 0.178445
C  -1.807345 0.508836 0.575555
C  -3.035373 1.233952 -1.555173
C  -1.035009 -0.283116 -1.794342
C  -4.111035 -0.690668 0.53345
C  -0.440444 0.29115 1.080719
C  -4.589003 -0.991365 1.743786
C  -6.061517 -1.034461 2.01427
C  -3.715733 -1.305309 2.919242
C  1.56722 1.443942 1.599008
C  3.084274 -0.391372 0.852826
C  2.515155 1.206868 -0.684462
C  3.718639 -0.750124 -0.461382
C  3.45228 0.276689 -2.745712
C  2.478208 -0.665096 -3.293004
C  1.68177 -1.459666 -3.714567
H  -2.161986 -1.62167 0.250916
H  -2.304619 1.378273 0.993014
H  -3.77822 1.64668 -0.872674
H  -2.456667 2.068415 -1.955191
H  -3.567326 0.772277 -2.389524
H  -0.406064 -1.034797 -1.318236
H  -1.474783 -0.743912 -2.680995
H  -0.390989 0.530135 -2.134249
H  -4.818172 -0.479903 -0.263926
H  -6.367337 -2.025591 2.358728
H  -6.33441 -0.335058 2.808576
H  -6.649487 -0.788029 1.13034
H  -3.883029 -0.586177 3.725368
H  -3.962154 -2.287601 3.33001
H  -2.653306 -1.299772 2.681755
H  1.845373 2.490521 1.689067
H  1.697715 0.960834 2.566427
H  4.797678 -0.873322 -0.354556
H  3.298469 -1.692128 -0.827022
H  4.460851 -0.031444 -3.023784
H  3.30414 1.267604 -3.174296
H  0.972434 -2.160821 -4.09345
elementType: O N C H
totalener: -1071.53878984 hartree
nucrepener: 2013.13350528 hartree
electener: -3084.67229512 hartree
oneelecener: -5459.34132956 hartree
twoeener: 2374.66903444 hartree
cpcmener: -0.05111321 hartree
kineticenergy: 1066.87233748 hartree
xcener: -102.626788448763 hartree
chargesum: 0.0000000
charge: -0.275552 -0.478138 -0.471045 -0.508084 -0.108358 -0.152822 0.188806 -0.027709 -0.142948 -0.296775 -0.294718 -0.292871 0.428812 -0.022969 -0.228639 -0.238078 0.066460 0.316744 0.371151 -0.002764 -0.021418 -0.420448 0.027028 0.103575 0.103852 0.094338 0.099358 0.100737 0.091588 0.108361 0.090410 0.125893 0.095713 0.094652 0.089454 0.098330 0.100108 0.075188 0.154465 0.137444 0.127302 0.128826 0.141821 0.134781 0.288140
qa: -0.2756 -0.4781 -0.4710 -0.5081 -0.1084 -0.1528 0.1888 -0.0277 -0.1429 -0.2968 -0.2947 -0.2929 0.4288 -0.0230 -0.2286 -0.2381 0.0665 0.3167 0.3712 -0.0028 -0.0214 -0.4204 0.0270 0.1036 0.1039 0.0943 0.0994 0.1007 0.0916 0.1084 0.0904 0.1259 0.0957 0.0947 0.0895 0.0983 0.1001 0.0752 0.1545 0.1374 0.1273 0.1288 0.1418 0.1348 0.2881
va: 2.1204 2.0173 2.0390 2.0002 3.1018 3.2018 3.7329 3.8389 3.8318 3.9024 3.8850 3.8841 4.1285 3.7175 3.9286 3.9309 3.8877 4.1718 4.3233 3.9012 3.8967 3.7331 3.6219 1.0230 1.0277 1.0014 1.0028 0.9988 1.0043 1.0004 1.0090 1.0016 0.9960 0.9964 1.0062 0.9985 0.9998 1.0237 0.9924 1.0149 1.0089 1.0045 0.9876 1.0035 0.9464
dispcorr: -0.024378034 hartree
energy: -1071.563167878457
dipole: -28.99773 29.36499 0.36727 -4.80334 4.90103 0.09769 -1.27965 0.10491 -1.17474
magnitude: 1.23468 au
magnitude: 3.13830 debye
