program: Orca
programVersion: 5.0.2
elementType: O O O O N N C C C C C C C C C C C C C C C C C H H H H H H H H H H H H H H H H H H H H H H
charge: 0
multiplicity: 1
keywords: wb97x-d3
keywords: def2-TZVPP
keywords: def2/J RIJCOSX
keywords: DEFGRID2
keywords: scfconv7
keywords: smallprint printgap noloewdin
keywords: NOSOSCF
formula: C17H22N2O4
InChI: InChI=1/C17H22N2O4/c1-6-7-18-9-13(20)19(16(18)22)10-23-15(21)14-12(8-11(2)3)17(14,4)5/h1,8,12,14H,7,9-10H2,2-5H3
45 atoms
O  0.566565 1.801473 1.277655
O  0.352807 1.665431 -0.944984
O  3.448964 1.865085 -1.341008
O  2.0209 -0.598718 2.213127
N  2.661718 0.946496 0.617724
N  3.253644 -1.176136 0.353294
C  -2.714624 1.494137 -0.352769
C  -2.178528 0.101915 -0.40509
C  -1.497358 1.12473 0.482294
C  -3.971943 1.757481 0.43843
C  -2.589596 2.372887 -1.572112
C  -2.863626 -1.05336 0.231448
C  -0.131855 1.556068 0.156733
C  -3.89897 -1.704191 -0.30438
C  -4.531289 -2.870479 0.39052
C  -4.513515 -1.333612 -1.618439
C  1.954576 2.066404 1.170023
C  3.250335 0.916681 -0.622951
C  2.58437 -0.33097 1.174867
C  3.602583 -0.520143 -0.885805
C  2.983948 -2.597876 0.388019
C  1.702137 -2.928601 -0.232551
C  0.641961 -3.170016 -0.743183
H  -1.628508 -0.126795 -1.315182
H  -1.691025 1.024646 1.544444
H  -4.032035 2.810284 0.720248
H  -4.854783 1.524969 -0.160973
H  -4.024802 1.164592 1.350736
H  -2.454983 3.419751 -1.293808
H  -1.769852 2.087575 -2.226817
H  -3.509402 2.30625 -2.156551
H  -2.479912 -1.385709 1.191899
H  -4.040805 -3.101162 1.336158
H  -5.587164 -2.675334 0.594802
H  -4.498446 -3.765643 -0.235645
H  -5.576358 -1.110458 -1.49655
H  -4.041092 -0.471567 -2.087095
H  -4.455924 -2.170199 -2.319765
H  2.158806 2.942739 0.556328
H  2.286173 2.262967 2.18578
H  3.011413 -0.888046 -1.730575
H  4.659415 -0.630561 -1.131656
H  3.004094 -2.943329 1.421329
H  3.794454 -3.11523 -0.125342
H  -0.296175 -3.392628 -1.201497
elementType: O N C H
totalener: -1071.53759173 hartree
nucrepener: 2012.56774836 hartree
electener: -3084.10534009 hartree
oneelecener: -5458.24372381 hartree
twoeener: 2374.13838371 hartree
cpcmener: -0.05116747 hartree
kineticenergy: 1066.87706947 hartree
xcener: -102.625243557019 hartree
chargesum: -0.0000000
charge: -0.287345 -0.487694 -0.466879 -0.503046 -0.125582 -0.168497 0.100612 -0.018366 -0.063637 -0.280409 -0.294128 -0.261611 0.411753 -0.038493 -0.228419 -0.254703 0.089406 0.310074 0.387132 0.000594 -0.027070 -0.424177 0.036650 0.107970 0.094517 0.103835 0.097762 0.093028 0.105383 0.093964 0.095038 0.123221 0.090639 0.095717 0.095211 0.099234 0.089641 0.106590 0.135277 0.151310 0.128855 0.125186 0.136518 0.141810 0.283127
qa: -0.2873 -0.4877 -0.4669 -0.5030 -0.1256 -0.1685 0.1006 -0.0184 -0.0636 -0.2804 -0.2941 -0.2616 0.4118 -0.0385 -0.2284 -0.2547 0.0894 0.3101 0.3871 0.0006 -0.0271 -0.4242 0.0366 0.1080 0.0945 0.1038 0.0978 0.0930 0.1054 0.0940 0.0950 0.1232 0.0906 0.0957 0.0952 0.0992 0.0896 0.1066 0.1353 0.1513 0.1289 0.1252 0.1365 0.1418 0.2831
va: 2.1090 2.0169 2.0435 2.0096 3.1051 3.1927 3.7326 3.7982 3.8074 3.9110 3.8888 3.8410 4.1538 3.7101 3.9251 3.9323 3.8802 4.1724 4.3236 3.9064 3.9056 3.7215 3.6104 1.0206 1.0345 1.0031 0.9986 1.0029 0.9997 1.0198 1.0002 1.0058 1.0070 0.9963 0.9959 0.9969 1.0062 1.0007 1.0158 0.9920 1.0037 1.0096 1.0001 0.9879 0.9506
dispcorr: -0.023555966 hartree
energy: -1071.561147699141
dipole: -33.83984 33.46917 -0.37068 -6.08745 4.66453 -1.42292 -6.05607 5.94002 -0.11606
magnitude: 1.47498 au
magnitude: 3.74910 debye
