program: Orca
programVersion: 5.0.2
elementType: O O O O N N C C C C C C C C C C C C C C C C C H H H H H H H H H H H H H H H H H H H H H H
charge: 0
multiplicity: 1
keywords: wb97x-d3
keywords: def2-TZVPP
keywords: def2/J RIJCOSX
keywords: DEFGRID2
keywords: scfconv7
keywords: smallprint printgap noloewdin
keywords: NOSOSCF
formula: C17H22N2O4
InChI: InChI=1/C17H22N2O4/c1-6-7-18-9-13(20)19(16(18)22)10-23-15(21)14-12(8-11(2)3)17(14,4)5/h1,8,12,14H,7,9-10H2,2-5H3
45 atoms
O  0.369668 1.409034 0.249645
O  -0.62423 0.818016 2.174388
O  3.532201 2.58233 -1.126667
O  2.099102 -1.070129 1.178161
N  2.643563 0.98152 0.26555
N  3.889139 -0.773312 -0.246846
C  -2.257924 -0.963212 0.132362
C  -3.107417 0.162293 0.641746
C  -1.735231 0.46643 0.082973
C  -2.574242 -1.59184 -1.202225
C  -1.694546 -1.947261 1.127922
C  -4.297974 0.64725 -0.08968
C  -0.643887 0.89812 0.969749
C  -5.545961 0.708241 0.385618
C  -6.667716 1.222689 -0.465696
C  -5.956644 0.277005 1.760024
C  1.594835 1.726396 0.889995
C  3.490117 1.452405 -0.705002
C  2.808432 -0.390567 0.468112
C  4.338682 0.283648 -1.122805
C  4.159265 -2.162293 -0.536927
C  3.411433 -2.650474 -1.693701
C  2.797032 -3.036377 -2.65127
H  -3.168654 0.209449 1.723987
H  -1.703564 0.899348 -0.911007
H  -1.693778 -2.098449 -1.601686
H  -3.363498 -2.338369 -1.093665
H  -2.902189 -0.866279 -1.945326
H  -1.600508 -1.537667 2.131176
H  -2.355353 -2.813366 1.193345
H  -0.712562 -2.307378 0.813915
H  -4.128856 0.976993 -1.110881
H  -7.149437 2.085985 0.000847
H  -6.330361 1.520369 -1.458289
H  -7.446521 0.465101 -0.586306
H  -5.131606 -0.069762 2.378906
H  -6.451467 1.09497 2.289571
H  -6.686837 -0.534138 1.69975
H  1.793695 2.786961 0.755868
H  1.567588 1.503891 1.953747
H  4.157069 0.054203 -2.176919
H  5.399573 0.505426 -0.99603
H  3.927715 -2.762265 0.342608
H  5.229135 -2.276757 -0.715131
H  2.266174 -3.382848 -3.50971
elementType: O N C H
totalener: -1071.54090618 hartree
nucrepener: 1936.51687320 hartree
electener: -3008.05777939 hartree
oneelecener: -5305.94392181 hartree
twoeener: 2297.88614243 hartree
cpcmener: -0.05136097 hartree
kineticenergy: 1066.85891270 hartree
xcener: -102.623550177535 hartree
chargesum: 0.0000000
charge: -0.282168 -0.477117 -0.474690 -0.512649 -0.110527 -0.166740 0.126747 0.033937 -0.113932 -0.264780 -0.284183 -0.287717 0.404849 -0.042844 -0.220330 -0.251800 0.070949 0.321983 0.411725 0.001376 -0.036858 -0.435731 0.053968 0.094682 0.094035 0.098227 0.097600 0.089301 0.094638 0.099894 0.091928 0.123435 0.094064 0.088994 0.093407 0.090000 0.095463 0.097421 0.129345 0.144891 0.127448 0.126123 0.135241 0.141651 0.288744
qa: -0.2822 -0.4771 -0.4747 -0.5126 -0.1105 -0.1667 0.1267 0.0339 -0.1139 -0.2648 -0.2842 -0.2877 0.4048 -0.0428 -0.2203 -0.2518 0.0709 0.3220 0.4117 0.0014 -0.0369 -0.4357 0.0540 0.0947 0.0940 0.0982 0.0976 0.0893 0.0946 0.0999 0.0919 0.1234 0.0941 0.0890 0.0934 0.0900 0.0955 0.0974 0.1293 0.1449 0.1274 0.1261 0.1352 0.1417 0.2887
va: 2.1096 2.0273 2.0385 1.9979 3.1256 3.1959 3.6752 3.7742 3.8601 3.9071 3.8970 3.8660 4.1572 3.7453 3.9210 3.9431 3.8692 4.1674 4.2805 3.9057 3.9086 3.7463 3.5855 1.0298 1.0367 1.0026 1.0025 1.0046 1.0157 1.0020 1.0097 1.0083 0.9961 1.0084 0.9964 1.0091 0.9973 0.9971 1.0138 1.0164 1.0056 1.0079 1.0013 0.9869 0.9447
dispcorr: -0.020953226 hartree
energy: -1071.561859409808
dipole: -33.98556 34.92974 0.94418 -7.95104 6.94368 -1.00736 -1.70379 0.09565 -1.60814
magnitude: 2.11952 au
magnitude: 5.38740 debye
