program: Orca
programVersion: 5.0.2
elementType: O O O O N N C C C C C C C C C C C C C C C C C H H H H H H H H H H H H H H H H H H H H H H
charge: 0
multiplicity: 1
keywords: wb97x-d3
keywords: def2-TZVPP
keywords: def2/J RIJCOSX
keywords: DEFGRID2
keywords: scfconv7
keywords: smallprint printgap noloewdin
keywords: NOSOSCF
formula: C17H22N2O4
InChI: InChI=1/C17H22N2O4/c1-6-7-18-9-13(20)19(16(18)22)10-23-15(21)14-12(8-11(2)3)17(14,4)5/h1,8,12,14H,7,9-10H2,2-5H3
45 atoms
O  -0.037112 -0.918449 0.637741
O  -1.438901 -1.428956 -1.041445
O  1.253449 0.011511 -2.174065
O  3.484935 -1.321512 1.565764
N  2.109919 -0.893835 -0.246761
N  3.956562 0.304229 0.002393
C  -2.498652 1.451685 -0.31504
C  -3.472853 0.404623 0.134823
C  -2.016073 0.279304 0.529538
C  -2.481143 2.799931 0.363235
C  -2.15601 1.532051 -1.782116
C  -4.479796 0.660931 1.184258
C  -1.177162 -0.772742 -0.062914
C  -5.782521 0.364081 1.127965
C  -6.692919 0.697702 2.271481
C  -6.463871 -0.295501 -0.031488
C  1.004032 -1.728011 0.116455
C  2.123075 -0.068138 -1.339704
C  3.236448 -0.696677 0.558917
C  3.416662 0.692515 -1.279888
C  5.353337 0.500938 0.317439
C  6.225955 -0.375155 -0.462413
C  6.919886 -1.09758 -1.125577
H  -3.776385 -0.276635 -0.652742
H  -1.765152 0.534631 1.553133
H  -1.519988 3.291974 0.204059
H  -3.255184 3.445577 -0.05616
H  -2.64438 2.738569 1.438073
H  -2.817233 2.252769 -2.266754
H  -1.131438 1.879426 -1.928416
H  -2.272125 0.58591 -2.30565
H  -4.113979 1.144735 2.085352
H  -7.495531 1.365654 1.948272
H  -7.179131 -0.200254 2.661313
H  -6.164388 1.179436 3.093738
H  -5.792682 -0.564811 -0.844283
H  -6.978678 -1.203531 0.291709
H  -7.233603 0.362538 -0.443035
H  1.323973 -2.411137 0.898592
H  0.679681 -2.305819 -0.745418
H  4.06131 0.393547 -2.1122
H  3.243495 1.767426 -1.346747
H  5.506522 0.337473 1.383843
H  5.610084 1.542993 0.124389
H  7.545964 -1.739842 -1.704059
elementType: O N C H
totalener: -1071.54080822 hartree
nucrepener: 1913.38359626 hartree
electener: -2984.92440448 hartree
oneelecener: -5259.46405454 hartree
twoeener: 2274.53965006 hartree
cpcmener: -0.05160978 hartree
kineticenergy: 1066.86011241 hartree
xcener: -102.623970705304 hartree
chargesum: 0.0000000
charge: -0.284575 -0.474836 -0.477064 -0.507507 -0.107002 -0.174321 0.113845 0.039061 -0.095607 -0.270552 -0.284724 -0.287146 0.404636 -0.050535 -0.217757 -0.252394 0.070720 0.324880 0.403295 0.004185 -0.031234 -0.432676 0.048626 0.094371 0.093264 0.098103 0.098518 0.090345 0.101106 0.092499 0.095517 0.122899 0.093176 0.093776 0.088701 0.090410 0.095910 0.097262 0.132335 0.144822 0.127974 0.124845 0.134597 0.141066 0.287188
qa: -0.2846 -0.4748 -0.4771 -0.5075 -0.1070 -0.1743 0.1138 0.0391 -0.0956 -0.2706 -0.2847 -0.2871 0.4046 -0.0505 -0.2178 -0.2524 0.0707 0.3249 0.4033 0.0042 -0.0312 -0.4327 0.0486 0.0944 0.0933 0.0981 0.0985 0.0903 0.1011 0.0925 0.0955 0.1229 0.0932 0.0938 0.0887 0.0904 0.0959 0.0973 0.1323 0.1448 0.1280 0.1248 0.1346 0.1411 0.2872
va: 2.1104 2.0279 2.0319 2.0120 3.1292 3.1940 3.6799 3.7810 3.8308 3.9081 3.8939 3.8672 4.1628 3.7597 3.9194 3.9407 3.8703 4.1513 4.2967 3.9049 3.9096 3.7373 3.5914 1.0301 1.0351 1.0017 1.0016 1.0056 1.0023 1.0082 1.0163 1.0093 0.9961 0.9963 1.0087 1.0104 0.9969 0.9970 1.0167 1.0144 1.0031 1.0105 1.0024 0.9874 0.9455
dispcorr: -0.020727828 hartree
energy: -1071.561536051141
dipole: -33.41606 34.48376 1.06770 13.20933 -11.41957 1.78976 2.21375 -2.02527 0.18848
magnitude: 2.09254 au
magnitude: 5.31882 debye
