program: Orca
programVersion: 5.0.2
elementType: O O O O N N C C C C C C C C C C C C C C C C C H H H H H H H H H H H H H H H H H H H H H H
charge: 0
multiplicity: 1
keywords: wb97x-d3
keywords: def2-TZVPP
keywords: def2/J RIJCOSX
keywords: DEFGRID2
keywords: scfconv7
keywords: smallprint printgap noloewdin
keywords: NOSOSCF
formula: C17H22N2O4
InChI: InChI=1/C17H22N2O4/c1-6-7-18-9-13(20)19(16(18)22)10-23-15(21)14-12(8-11(2)3)17(14,4)5/h1,8,12,14H,7,9-10H2,2-5H3
45 atoms
O  0.1627 1.452252 0.98065
O  -0.16118 -0.710858 1.446347
O  2.942805 -1.168782 1.819662
O  1.770865 1.644538 -1.574022
N  2.216899 0.463138 0.364608
N  2.808208 -0.412326 -1.57258
C  -2.41815 0.119525 -0.759788
C  -2.957941 -0.504156 0.488146
C  -1.965528 0.62178 0.603264
C  -3.289301 1.066348 -1.547291
C  -1.462164 -0.669108 -1.620564
C  -4.367824 -0.314543 0.920096
C  -0.59211 0.349201 1.06529
C  -4.773335 -0.239775 2.189964
C  -6.220207 -0.071549 2.539264
C  -3.839169 -0.312149 3.358115
C  1.546275 1.348619 1.269196
C  2.799758 -0.731416 0.706768
C  2.226164 0.669457 -1.019961
C  3.245112 -1.364156 -0.586701
C  2.995777 -0.59768 -2.986975
C  4.398598 -0.502835 -3.384529
C  5.551502 -0.44234 -3.715256
H  -2.53849 -1.482073 0.714525
H  -2.346073 1.600749 0.876378
H  -2.675792 1.766153 -2.117994
H  -3.911293 0.519137 -2.259155
H  -3.951376 1.65394 -0.9111
H  -0.857158 -1.375978 -1.053261
H  -2.01689 -1.245445 -2.364012
H  -0.785281 -0.003888 -2.161572
H  -5.11757 -0.264898 0.134948
H  -6.376807 0.831677 3.135099
H  -6.853626 -0.004408 1.654635
H  -6.577629 -0.90696 3.147291
H  -2.802462 -0.482913 3.072807
H  -3.878255 0.610774 3.943553
H  -4.133751 -1.116877 4.036893
H  1.932249 2.359958 1.167597
H  1.725025 1.001403 2.286622
H  4.329799 -1.503515 -0.58868
H  2.772298 -2.341458 -0.715545
H  2.40709 0.149632 -3.520016
H  2.600649 -1.573967 -3.279415
H  6.57575 -0.384683 -4.00911
elementType: O N C H
totalener: -1071.54480742 hartree
nucrepener: 1982.30685194 hartree
electener: -3053.85165936 hartree
oneelecener: -5397.13040183 hartree
twoeener: 2343.27874248 hartree
cpcmener: -0.04148741 hartree
kineticenergy: 1066.87269686 hartree
xcener: -102.625017799687 hartree
chargesum: 0.0000000
charge: -0.272334 -0.448999 -0.441657 -0.483945 -0.120563 -0.132960 0.173109 -0.018224 -0.132292 -0.293565 -0.285739 -0.294334 0.391229 -0.021110 -0.228503 -0.234508 0.075929 0.296646 0.347690 -0.002308 -0.069302 -0.437521 0.088077 0.104338 0.102214 0.098646 0.098563 0.093199 0.090777 0.103861 0.092598 0.122714 0.093601 0.088802 0.095674 0.077109 0.096946 0.099311 0.148320 0.134394 0.126505 0.122382 0.129075 0.142317 0.283837
qa: -0.2723 -0.4490 -0.4417 -0.4839 -0.1206 -0.1330 0.1731 -0.0182 -0.1323 -0.2936 -0.2857 -0.2943 0.3912 -0.0211 -0.2285 -0.2345 0.0759 0.2966 0.3477 -0.0023 -0.0693 -0.4375 0.0881 0.1043 0.1022 0.0986 0.0986 0.0932 0.0908 0.1039 0.0926 0.1227 0.0936 0.0888 0.0957 0.0771 0.0969 0.0993 0.1483 0.1344 0.1265 0.1224 0.1291 0.1423 0.2838
va: 2.1198 2.0520 2.0784 2.0352 3.0946 3.1900 3.7092 3.8276 3.8056 3.8999 3.8878 3.8853 4.1824 3.7163 3.9309 3.9302 3.8922 4.2110 4.3297 3.8877 3.9075 3.7725 3.5416 1.0248 1.0267 1.0035 0.9995 1.0014 1.0118 1.0022 1.0097 1.0025 0.9967 1.0065 0.9962 1.0223 0.9988 1.0002 0.9928 1.0159 1.0051 1.0076 1.0084 0.9842 0.9477
dispcorr: -0.023231522 hartree
energy: -1071.568038938331
dipole: -30.60281 30.55022 -0.05259 -1.97853 1.72290 -0.25563 1.32926 -2.50714 -1.17788
magnitude: 1.20645 au
magnitude: 3.06654 debye
