program: Orca
programVersion: 5.0.2
elementType: O O O O N N C C C C C C C C C C C C C C C C C H H H H H H H H H H H H H H H H H H H H H H
charge: 0
multiplicity: 1
keywords: wb97x-d3
keywords: def2-TZVPP
keywords: def2/J RIJCOSX
keywords: DEFGRID2
keywords: scfconv7
keywords: smallprint printgap noloewdin
keywords: NOSOSCF
formula: C17H22N2O4
InChI: InChI=1/C17H22N2O4/c1-6-7-18-9-13(20)19(16(18)22)10-23-15(21)14-12(8-11(2)3)17(14,4)5/h1,8,12,14H,7,9-10H2,2-5H3
45 atoms
O  0.079583 1.045291 0.597921
O  -0.219402 2.900968 1.792248
O  1.809043 1.052623 -2.237464
O  2.576721 -1.217598 1.638655
N  2.086315 0.207627 -0.119728
N  2.956873 -1.771185 -0.564924
C  -2.81133 1.889803 -0.341917
C  -2.740473 0.547937 0.330653
C  -2.13297 1.748355 1.010652
C  -4.12312 2.634452 -0.353254
C  -1.988385 2.123696 -1.584436
C  -3.935786 -0.08413 0.937497
C  -0.683649 1.967474 1.180436
C  -4.5752 -1.157321 0.463969
C  -5.77273 -1.716437 1.170792
C  -4.183814 -1.885372 -0.785515
C  1.48774 1.259799 0.62694
C  2.186757 0.188623 -1.487225
C  2.556927 -0.981875 0.453051
C  2.858928 -1.110956 -1.841028
C  3.679535 -3.003265 -0.379885
C  5.125318 -2.824062 -0.498431
C  6.309496 -2.66171 -0.616351
H  -2.030749 -0.136917 -0.121535
H  -2.6972 2.169689 1.836747
H  -3.95811 3.703129 -0.5042
H  -4.755848 2.279693 -1.170001
H  -4.683943 2.514861 0.573309
H  -1.688931 3.170928 -1.665246
H  -1.087044 1.51529 -1.630967
H  -2.581349 1.885521 -2.469901
H  -4.318508 0.377308 1.843662
H  -6.649079 -1.719114 0.516945
H  -5.606026 -2.755858 1.466424
H  -6.024991 -1.149824 2.067498
H  -5.006905 -1.875273 -1.505214
H  -3.311296 -1.463746 -1.281628
H  -3.974198 -2.937413 -0.574754
H  1.742853 2.217451 0.17328
H  1.865826 1.235895 1.64816
H  2.261351 -1.677124 -2.558602
H  3.839021 -0.914076 -2.287374
H  3.338929 -3.72854 -1.121653
H  3.42976 -3.417286 0.597298
H  7.363105 -2.521237 -0.711979
elementType: O N C H
totalener: -1071.54700467 hartree
nucrepener: 1929.16664856 hartree
electener: -3000.71365323 hartree
oneelecener: -5290.18206208 hartree
twoeener: 2289.46840885 hartree
cpcmener: -0.04174437 hartree
kineticenergy: 1066.87133838 hartree
xcener: -102.622554708981 hartree
chargesum: 0.0000000
charge: -0.266124 -0.461476 -0.447498 -0.482373 -0.125951 -0.160592 0.134926 0.045927 -0.138575 -0.265373 -0.277800 -0.293057 0.405983 -0.029632 -0.227001 -0.253109 0.062823 0.295054 0.385242 0.008456 -0.051830 -0.424945 0.061919 0.099579 0.094552 0.098347 0.095036 0.089051 0.102483 0.078609 0.095234 0.119360 0.093001 0.094096 0.088423 0.096034 0.087740 0.096361 0.140551 0.133614 0.122581 0.124681 0.139411 0.132865 0.283395
qa: -0.2661 -0.4615 -0.4475 -0.4824 -0.1260 -0.1606 0.1349 0.0459 -0.1386 -0.2654 -0.2778 -0.2931 0.4060 -0.0296 -0.2270 -0.2531 0.0628 0.2951 0.3852 0.0085 -0.0518 -0.4249 0.0619 0.0996 0.0946 0.0983 0.0950 0.0891 0.1025 0.0786 0.0952 0.1194 0.0930 0.0941 0.0884 0.0960 0.0877 0.0964 0.1406 0.1336 0.1226 0.1247 0.1394 0.1329 0.2834
va: 2.1068 2.0418 2.0659 2.0445 3.1545 3.1921 3.6910 3.7338 3.9312 3.9063 3.9141 3.8687 4.1573 3.7194 3.9271 3.9447 3.8978 4.1825 4.3116 3.8993 3.9047 3.7387 3.5781 1.0178 1.0338 1.0025 1.0030 1.0034 1.0005 1.0156 1.0027 1.0083 0.9963 0.9956 1.0082 0.9976 1.0088 0.9977 0.9995 1.0078 1.0096 1.0043 0.9860 1.0043 0.9481
dispcorr: -0.021087391 hartree
energy: -1071.568092064271
dipole: -32.22661 32.27934 0.05273 -2.88422 0.81662 -2.06760 -5.88187 4.04264 -1.83923
magnitude: 2.76776 au
magnitude: 7.03509 debye
