program: Gaussian 09
title: 000074798
version: EM64L-G09RevD.01
frameworkgroup: C1[X(C8H7Cl2NO2)]
method: RPBEPBE
basis: SDD
operation: Freq
keyword: #p
keyword: freq=noraman
keyword: PBEPBE/SDD
title: #p freq=noraman PBEPBE/SDD
converged: YES YES NO NO
title: Mulliken charges:
elementType: Cl Cl O O N C C C C C C C C H H H H H H H
charge: -0.027892 -0.043044 -0.298930 -0.256872 -0.602239 0.522940 -0.289285 -0.310290 -0.350374 -0.195523 -0.218957 -0.109446 0.162333 0.261040 0.251477 0.251440 0.283367 0.260664 0.339452 0.370139
chargesum: 0.00000
title: Mulliken charges with hydrogens summed into heavy atoms:
elementType: Cl Cl O O N C C C C C C C C
charge: -0.027892 -0.043044 -0.298930 -0.256872 0.107351 0.522940 -0.289285 -0.049250 0.152543 0.087844 0.041708 -0.109446 0.162333
polarizability: 1.77709442e+02 6.12974103e+00 1.29016204e+02 6.16670472e-02 -4.45826848e-02 4.93022352e+01
1716.lowfreq: -4.8821 -3.0791 0.0025 0.0026 0.0027 6.6507 32.4633 47.5043 73.3421
frequency: 32.3768 47.4847 73.3417 119.4341 137.2083 167.6998 169.6270 211.6025 244.3647 327.7958 364.9452 388.7447 438.5318 438.8950 516.8226 521.1334 543.0523 547.1588 640.0902 655.9058 669.6876 698.7770 708.4420 803.0420 816.7806 864.0285 876.1682 929.2426 983.2283 1001.1981 1031.6592 1075.5838 1085.9276 1148.9653 1202.3468 1236.2740 1256.1898 1334.4595 1355.3238 1374.8472 1390.9726 1446.7173 1468.7781 1571.9210 1576.6611 1599.3969 1657.2170 2986.4123 3053.9517 3162.4924 3181.0005 3183.1141 3501.6525 3663.6301
redmass: 7.1456 6.1154 9.4991 6.5066 3.0416 5.3730 17.0521 6.2641 10.6750 7.6682 8.0812 9.2271 3.2793 8.7138 3.0792 1.6652 5.1572 4.1070 8.0387 1.5650 1.1280 3.8783 8.5059 1.4520 6.9436 1.3910 3.7168 1.3458 7.5226 1.8325 3.9085 1.8451 2.5336 1.3081 1.0715 2.7151 1.5303 1.3967 3.9721 4.2069 5.4522 1.2500 2.0682 6.3061 1.4531 5.8703 5.5923 1.0554 1.1069 1.0880 1.0952 1.0954 1.0455 1.1042
irintensity: 0.0002 8.1376 3.4814 0.0300 10.2930 0.0698 1.1964 12.4020 0.8909 0.2243 2.0512 6.6640 7.2547 10.8719 3.7797 27.1266 9.0295 10.6650 14.9124 240.7188 40.6776 0.9380 79.0923 59.0066 7.9284 22.1667 2.4263 0.2999 57.3926 0.2619 90.5322 17.7894 31.5181 3.3831 2.0039 135.5679 110.1919 1.6508 37.5851 68.9239 2.0523 129.8415 169.3580 16.8631 125.1653 7.2836 350.8519 20.2709 14.5879 3.9302 0.2272 2.1523 52.7279 86.8403
temp: 298.150 k
press: 1.00000 atm
elementType: 17 17 8 8 7 6 6 6 6 6 6 6 6 1 1 1 1 1 1 1
symmnumber: 1
zpe: 361764.5 jmol-1
zpe.correction: 0.137789 hartree
zpe.thermalcorrener: 0.150377 hartree
zpe.thermalcorrenthalpy: 0.151321 hartree
zpe.thermalcorrgfe: 0.096818 hartree
zpe.sumelectzpe: -1433.422154 hartree
zpe.sumelectthermal: -1433.409566 hartree
zpe.sumelectthermalent: -1433.408622 hartree
zpe.sumelectthermalfe: -1433.463125 hartree
dipole: -0.9745 0.5901 0.0117
dipole: 1.1393
quadrupole: -107.9234 -84.2389 -91.2371
quadrupole: 13.3003 0.0570 -0.0482
quadrupole: -13.4569 10.2276 3.2294 13.3003 0.0570 -0.0482
hfenergy: -1433.559943 hartree
pointgroup: C01 [X(C8H7Cl2N1O2)]
dipole: -0.3420432 -0.2419604 -0.159327 debye
dipolederiv: -0.3194878 0.2489541 0.1202446 0.2796575 -0.4203246 -0.1919676 0.1369303 -0.1935729 -0.1390336 -0.8550053 -0.0097834 -0.0525801 -0.0253732 -0.108331 -0.0299534 -0.0607249 -0.0290198 -0.0759723 -1.9224803 -0.391026 -0.3152794 -0.3175829 -0.3538323 -0.0690705 -0.2728774 -0.0738949 -0.3203673 -0.932933 -0.3252508 -0.2148358 -0.1598711 -0.7577387 -0.2232948 -0.1247522 -0.2346316 -0.5090217 -0.4758607 0.1881712 0.1169939 0.0743198 -0.9687275 -0.1628282 0.0535848 -0.1548759 -0.7468324 1.4724358 0.3701199 0.2830968 0.0570683 -0.1183736 -0.1356367 0.1077414 -0.1168153 0.0749941 0.157956 -0.3879869 -0.1985992 -0.5360344 0.5866095 0.3428505 -0.2797777 0.351315 0.0813987 -0.2099565 -0.1633157 -0.0914461 0.151907 -0.0248884 0.0976073 0.0829087 0.0789608 -0.1380486 0.372107 0.2305442 0.1258573 0.6558927 0.4506212 0.0822434 0.3607285 0.0566827 0.4268424 -0.2894697 0.0504507 0.0133246 0.0686643 -0.1142019 -0.0327154 0.0234869 -0.0337329 -0.0650539 -0.2300857 0.0571203 0.0236115 -0.0663798 0.0175082 0.0597897 -0.0441183 0.067209 -0.0641701 1.1874144 0.008829 0.0801297 0.0586831 0.0127609 0.0598961 0.1071778 0.0569665 -0.0524242 1.2400718 0.1233267 0.1348788 0.0386251 1.2124482 0.5695488 0.0897209 0.5753975 0.5093356 0.0525428 -0.0561923 -0.0378005 -0.0640472 0.0282735 -0.0830222 -0.042084 -0.0825492 0.1248403 0.0259285 0.0387341 -0.0337936 -0.0804479 -0.0747147 0.0280192 -0.0831101 0.0524272 0.0250634 0.0161216 -0.0031227 0.0602215 -0.1099286 0.0392477 -0.0287339 -0.0158781 -0.0392867 -0.0785408 0.0871653 -0.0275382 -0.0200378 -0.0262996 0.0692093 -0.0573069 -0.0192613 -0.0573631 0.1383651 0.0460621 0.0552438 0.0230116 0.0568207 0.0507439 -0.0615827 0.0238053 -0.0618226 0.1365055 0.1707882 -0.0218329 -0.0261146 -0.0062395 0.2422379 -0.0811526 -0.0173428 -0.0824088 0.3417353 0.4066854 0.0145549 0.0091169 -0.0494342 0.2314724 -0.08269 -0.0261578 -0.0789852 0.3303844 unknown
polarizability: 178.0586565|-1.8513128|109.967246|6.730488|33.2587804|68.0019787 unknown
InChI: InChI=1S/C8H7Cl2NO2/c9-5-1-2-7(6(10)3-5)13-4-8(11)12/h1-3H,4,11H2
charge 0 multiplicity 1
20 atoms
Cl 0.255968 -2.20735 -1.312135
Cl -4.72793 0.062297 -0.359367
O  1.284164 0.191072 0.064378
O  4.320147 1.838483 1.171769
N  3.865281 -0.160545 0.038007
C  -0.108226 0.232388 0.00579
C  -0.752349 -0.859982 -0.631944
C  -0.905343 1.277689 0.532818
C  2.002485 1.292751 0.719474
C  -2.150161 -0.924294 -0.749248
C  -2.313076 1.230902 0.423918
C  -2.915514 0.132884 -0.214203
C  3.511849 1.009712 0.661113
H  -0.438957 2.132851 1.029648
H  1.806091 2.252922 0.204668
H  1.703201 1.382168 1.781633
H  -2.626427 -1.774706 -1.243181
H  -2.924369 2.040066 0.832132
H  4.851798 -0.405366 -0.033897
H  3.14207 -0.770641 -0.347373
