program: Orca
programVersion: 5.0.2
elementType: O O O O N N C C C C C C C C C C C C C C C C C H H H H H H H H H H H H H H H H H H H H H H
charge: 0
multiplicity: 1
keywords: wb97x-d3
keywords: def2-TZVPP
keywords: def2/J RIJCOSX
keywords: DEFGRID2
keywords: scfconv7
keywords: smallprint printgap noloewdin
keywords: NOSOSCF
formula: C17H22N2O4
InChI: InChI=1/C17H22N2O4/c1-6-7-18-9-13(20)19(16(18)22)10-23-15(21)14-12(8-11(2)3)17(14,4)5/h1,8,12,14H,7,9-10H2,2-5H3
45 atoms
O  0.044373 0.667962 1.161728
O  -0.564345 2.769099 0.673022
O  2.833492 -1.40323 2.093656
O  2.056183 1.713057 -1.131435
N  2.303812 0.377976 0.738798
N  3.464741 -0.109841 -1.079243
C  -2.067169 -0.003045 -1.03615
C  -2.494803 -0.412723 0.331762
C  -2.030523 1.01382 0.098523
C  -3.111942 0.26679 -2.092378
C  -0.79142 -0.572114 -1.608961
C  -3.914472 -0.681421 0.678825
C  -0.792005 1.584289 0.65358
C  -4.422823 -0.622456 1.912432
C  -5.858776 -0.954551 2.180724
C  -3.621022 -0.234835 3.116551
C  1.349305 1.053914 1.559948
C  2.919403 -0.807965 1.049938
C  2.565087 0.765111 -0.579317
C  3.712443 -1.200526 -0.169701
C  3.749103 -0.200862 -2.49036
C  2.790803 -1.054084 -3.191994
C  1.987407 -1.758682 -3.740497
H  -1.774016 -1.03255 0.857625
H  -2.814141 1.761324 0.041685
H  -4.008464 0.738206 -1.689701
H  -2.711415 0.930277 -2.86127
H  -3.413723 -0.660503 -2.584342
H  -1.026137 -1.451066 -2.21353
H  -0.296901 0.149315 -2.26167
H  -0.081424 -0.890275 -0.848391
H  -4.57268 -0.974106 -0.134358
H  -6.38061 -0.107133 2.633314
H  -6.394324 -1.233609 1.273135
H  -5.944865 -1.782671 2.889551
H  -2.603043 0.070028 2.878054
H  -4.100185 0.590291 3.650036
H  -3.563303 -1.064805 3.826283
H  1.493125 2.129676 1.488604
H  1.494579 0.743218 2.59203
H  4.771686 -1.310314 0.072521
H  3.346088 -2.156425 -0.556644
H  4.760198 -0.590202 -2.619753
H  3.745809 0.800748 -2.921358
H  1.273935 -2.380792 -4.233228
elementType: O N C H
totalener: -1071.54460271 hartree
nucrepener: 2001.03487743 hartree
electener: -3072.57948014 hartree
oneelecener: -5434.42191841 hartree
twoeener: 2361.84243827 hartree
cpcmener: -0.04355235 hartree
kineticenergy: 1066.86931209 hartree
xcener: -102.623460738754 hartree
chargesum: -0.0000000
charge: -0.276311 -0.448864 -0.446282 -0.470599 -0.105981 -0.145054 0.171518 0.007082 -0.121944 -0.300750 -0.295502 -0.306276 0.400072 -0.007407 -0.228058 -0.245288 0.057505 0.301766 0.343611 -0.005268 -0.030339 -0.416334 0.034042 0.106830 0.092298 0.092606 0.100286 0.099183 0.099142 0.098570 0.089224 0.122148 0.094458 0.088656 0.094157 0.079258 0.094831 0.100755 0.144392 0.127800 0.125505 0.126386 0.139588 0.134825 0.283765
qa: -0.2763 -0.4489 -0.4463 -0.4706 -0.1060 -0.1451 0.1715 0.0071 -0.1219 -0.3008 -0.2955 -0.3063 0.4001 -0.0074 -0.2281 -0.2453 0.0575 0.3018 0.3436 -0.0053 -0.0303 -0.4163 0.0340 0.1068 0.0923 0.0926 0.1003 0.0992 0.0991 0.0986 0.0892 0.1221 0.0945 0.0887 0.0942 0.0793 0.0948 0.1008 0.1444 0.1278 0.1255 0.1264 0.1396 0.1348 0.2838
va: 2.0800 2.0592 2.0736 2.0475 3.1112 3.1748 3.7294 3.7849 3.8300 3.9126 3.8898 3.8818 4.1534 3.7052 3.9295 3.9407 3.8840 4.1845 4.3465 3.9008 3.9089 3.7340 3.6135 1.0198 1.0295 1.0017 1.0019 0.9990 1.0012 1.0050 1.0046 1.0031 0.9969 1.0068 0.9958 1.0173 0.9992 0.9984 1.0199 1.0118 1.0081 1.0042 0.9869 1.0009 0.9490
dispcorr: -0.024078332 hartree
energy: -1071.568681042041
dipole: -27.00056 27.82595 0.82539 -7.84054 5.87560 -1.96494 -0.59123 -0.19099 -0.78222
magnitude: 2.27027 au
magnitude: 5.77057 debye
