program: Orca
programVersion: 5.0.2
elementType: O O O O N N C C C C C C C C C C C C C C C C C H H H H H H H H H H H H H H H H H H H H H H
charge: 0
multiplicity: 1
keywords: wb97x-d3
keywords: def2-TZVPP
keywords: def2/J RIJCOSX
keywords: DEFGRID2
keywords: scfconv7
keywords: smallprint printgap noloewdin
keywords: NOSOSCF
formula: C17H22N2O4
InChI: InChI=1/C17H22N2O4/c1-6-7-18-9-13(20)19(16(18)22)10-23-15(21)14-12(8-11(2)3)17(14,4)5/h1,8,12,14H,7,9-10H2,2-5H3
45 atoms
O  -0.00597 0.7198 1.157466
O  -0.130582 2.956565 1.221753
O  1.924172 1.84999 -1.179482
O  2.4887 -1.965901 1.244183
N  2.071291 0.112675 0.311151
N  3.023835 -1.440955 -0.933558
C  -2.466095 1.108216 -0.734032
C  -2.822452 0.448099 0.565876
C  -2.051044 1.747121 0.58256
C  -3.54157 1.834237 -1.503714
C  -1.447523 0.447317 -1.630291
C  -4.210351 0.441524 1.086717
C  -0.645938 1.887076 1.008986
C  -5.005632 -0.628985 1.166568
C  -6.390745 -0.522638 1.729327
C  -4.608435 -2.002944 0.720959
C  1.389687 0.715484 1.413342
C  2.261083 0.727405 -0.897916
C  2.535314 -1.209027 0.302294
C  2.956189 -0.276735 -1.778157
C  3.760241 -2.625713 -1.293972
C  5.198934 -2.378801 -1.369304
C  6.375758 -2.151832 -1.446038
H  -2.238084 -0.438721 0.78719
H  -2.623921 2.632431 0.839201
H  -3.100461 2.564452 -2.185239
H  -4.12175 1.129912 -2.103975
H  -4.238071 2.366898 -0.857036
H  -1.961899 -0.176887 -2.364041
H  -0.867721 1.188506 -2.18391
H  -0.753964 -0.197797 -1.094569
H  -4.603446 1.395338 1.427547
H  -6.521143 -1.192323 2.583881
H  -6.625613 0.48966 2.058537
H  -7.13959 -0.818712 0.989776
H  -4.561295 -2.689653 1.570653
H  -5.355366 -2.413684 0.037004
H  -3.646167 -2.035676 0.213032
H  1.771493 1.720711 1.57836
H  1.56645 0.116567 2.30343
H  2.379768 -0.455977 -2.688941
H  3.9459 0.092361 -2.063792
H  3.401853 -2.995355 -2.257264
H  3.550643 -3.40651 -0.56262
H  7.422413 -1.953275 -1.508062
elementType: O N C H
totalener: -1071.54544361 hartree
nucrepener: 1948.30485147 hartree
electener: -3019.85029508 hartree
oneelecener: -5328.59025112 hartree
twoeener: 2308.73995604 hartree
cpcmener: -0.04312984 hartree
kineticenergy: 1066.86676969 hartree
xcener: -102.624092581311 hartree
chargesum: -0.0000000
charge: -0.273141 -0.448993 -0.440343 -0.484482 -0.105255 -0.157345 0.148684 0.053123 -0.157757 -0.265466 -0.299029 -0.298999 0.413444 -0.024288 -0.227218 -0.255687 0.050882 0.268373 0.386126 0.018545 -0.046670 -0.426399 0.059383 0.101593 0.091356 0.099315 0.094266 0.089465 0.099708 0.101293 0.084780 0.118669 0.093502 0.088509 0.093573 0.099553 0.093563 0.088195 0.144596 0.131194 0.120479 0.125881 0.139537 0.129987 0.283496
qa: -0.2731 -0.4490 -0.4403 -0.4845 -0.1053 -0.1573 0.1487 0.0531 -0.1578 -0.2655 -0.2990 -0.2990 0.4134 -0.0243 -0.2272 -0.2557 0.0509 0.2684 0.3861 0.0185 -0.0467 -0.4264 0.0594 0.1016 0.0914 0.0993 0.0943 0.0895 0.0997 0.1013 0.0848 0.1187 0.0935 0.0885 0.0936 0.0996 0.0936 0.0882 0.1446 0.1312 0.1205 0.1259 0.1395 0.1300 0.2835
va: 2.1010 2.0589 2.0734 2.0453 3.1121 3.1919 3.6679 3.7250 3.9063 3.9055 3.9078 3.8722 4.1841 3.7134 3.9275 3.9468 3.8823 4.2028 4.3058 3.8937 3.8992 3.7384 3.5813 1.0202 1.0351 1.0018 1.0035 1.0038 1.0030 1.0057 1.0120 1.0089 0.9952 1.0083 0.9965 0.9968 0.9983 1.0077 1.0172 1.0153 1.0081 1.0061 0.9853 1.0081 0.9482
dispcorr: -0.022213747 hartree
energy: -1071.567657361254
dipole: -32.14220 32.18109 0.03889 -4.97417 3.05933 -1.91485 -5.10363 3.43413 -1.66949
magnitude: 2.54074 au
magnitude: 6.45805 debye
