program: Orca
programVersion: 5.0.2
elementType: O O O O N N C C C C C C C C C C C C C C C C C H H H H H H H H H H H H H H H H H H H H H H
charge: 0
multiplicity: 1
keywords: wb97x-d3
keywords: def2-TZVPP
keywords: def2/J RIJCOSX
keywords: DEFGRID2
keywords: scfconv7
keywords: smallprint printgap noloewdin
keywords: NOSOSCF
formula: C17H22N2O4
InChI: InChI=1/C17H22N2O4/c1-6-7-18-9-13(20)19(16(18)22)10-23-15(21)14-12(8-11(2)3)17(14,4)5/h1,8,12,14H,7,9-10H2,2-5H3
45 atoms
O  -0.041903 0.715305 1.098043
O  -0.168503 2.947196 1.263856
O  2.054386 1.974291 -1.105987
O  2.307785 -2.024562 1.062885
N  2.046136 0.134156 0.265221
N  2.921796 -1.395185 -1.065745
C  -2.465288 1.221479 -0.829835
C  -2.826262 0.456252 0.411211
C  -2.07568 1.765402 0.534736
C  -3.52808 1.997295 -1.568793
C  -1.416501 0.641709 -1.749117
C  -4.205246 0.386427 0.938088
C  -0.678141 1.888794 0.990394
C  -4.860845 -0.718259 1.309931
C  -6.250081 -0.63389 1.868802
C  -4.308439 -2.108996 1.229002
C  1.348701 0.69289 1.379538
C  2.312698 0.816453 -0.893088
C  2.423335 -1.211701 0.175208
C  2.975609 -0.168632 -1.81911
C  3.628051 -2.585532 -1.467031
C  5.075981 -2.455117 -1.313176
C  6.264763 -2.334323 -1.192321
H  -2.223582 -0.430845 0.567248
H  -2.665397 2.620163 0.849516
H  -3.074249 2.784139 -2.174778
H  -4.082234 1.340386 -2.242647
H  -4.248006 2.47185 -0.903197
H  -0.836227 1.430645 -2.232223
H  -0.724021 -0.028718 -1.243854
H  -1.901458 0.063456 -2.538389
H  -4.72104 1.336508 1.046796
H  -6.957095 -1.200713 1.256941
H  -6.295645 -1.067206 2.871755
H  -6.609049 0.393528 1.932155
H  -4.997626 -2.761614 0.686997
H  -3.341579 -2.172341 0.733356
H  -4.199408 -2.540933 2.227595
H  1.733971 1.687361 1.593667
H  1.504198 0.055896 2.246828
H  2.432816 -0.23742 -2.764582
H  4.001395 0.147943 -2.032006
H  3.388473 -2.80476 -2.509394
H  3.263285 -3.429421 -0.880707
H  7.320902 -2.225959 -1.083509
elementType: O N C H
totalener: -1071.54624811 hartree
nucrepener: 1949.94975046 hartree
electener: -3021.49599858 hartree
oneelecener: -5331.86332108 hartree
twoeener: 2310.36732251 hartree
cpcmener: -0.04399273 hartree
kineticenergy: 1066.85804802 hartree
xcener: -102.622190245142 hartree
chargesum: -0.0000000
charge: -0.272987 -0.448406 -0.439925 -0.482909 -0.107057 -0.163577 0.105271 0.081819 -0.129019 -0.271827 -0.277392 -0.297851 0.410721 -0.042060 -0.221427 -0.255269 0.050438 0.270615 0.389123 0.013951 -0.052527 -0.426989 0.064721 0.096647 0.090509 0.098821 0.095678 0.087997 0.100231 0.080446 0.099879 0.116346 0.093269 0.092875 0.087815 0.093687 0.089664 0.098349 0.143492 0.131673 0.121519 0.128464 0.139403 0.132315 0.283485
qa: -0.2730 -0.4484 -0.4399 -0.4829 -0.1071 -0.1636 0.1053 0.0818 -0.1290 -0.2718 -0.2774 -0.2979 0.4107 -0.0421 -0.2214 -0.2553 0.0504 0.2706 0.3891 0.0140 -0.0525 -0.4270 0.0647 0.0966 0.0905 0.0988 0.0957 0.0880 0.1002 0.0804 0.0999 0.1163 0.0933 0.0929 0.0878 0.0937 0.0897 0.0983 0.1435 0.1317 0.1215 0.1285 0.1394 0.1323 0.2835
va: 2.1015 2.0594 2.0732 2.0458 3.1133 3.1833 3.7000 3.7139 3.8432 3.9094 3.9079 3.8683 4.1868 3.7600 3.9244 3.9431 3.8855 4.1977 4.3022 3.8927 3.9056 3.7412 3.5799 1.0267 1.0343 1.0011 1.0024 1.0059 1.0048 1.0133 1.0025 1.0116 0.9965 0.9955 1.0091 0.9978 1.0100 0.9962 1.0184 1.0141 1.0087 1.0048 0.9855 1.0044 0.9480
dispcorr: -0.021921935 hartree
energy: -1071.568170046322
dipole: -31.04883 31.15732 0.10849 -4.71412 2.90327 -1.81085 -4.10219 2.40444 -1.69775
magnitude: 2.48461 au
magnitude: 6.31538 debye
