program: Orca
programVersion: 5.0.2
elementType: O O O O N N C C C C C C C C C C C C C C C C C H H H H H H H H H H H H H H H H H H H H H H
charge: 0
multiplicity: 1
keywords: wb97x-d3
keywords: def2-TZVPP
keywords: def2/J RIJCOSX
keywords: DEFGRID2
keywords: scfconv7
keywords: smallprint printgap noloewdin
keywords: NOSOSCF
formula: C17H22N2O4
InChI: InChI=1/C17H22N2O4/c1-6-7-18-9-13(20)19(16(18)22)10-23-15(21)14-12(8-11(2)3)17(14,4)5/h1,8,12,14H,7,9-10H2,2-5H3
45 atoms
O  0.379009 1.308765 -0.0203
O  -0.980366 1.256402 -1.800569
O  3.846531 1.913264 0.893972
O  1.587559 -1.424367 -1.230347
N  2.51333 0.487889 -0.322299
N  3.442649 -1.46005 0.140321
C  -3.135676 1.85916 0.42167
C  -3.208949 0.425047 0.000155
C  -1.874712 1.004104 0.405701
C  -3.649114 2.235567 1.788988
C  -3.351474 2.936354 -0.611886
C  -3.831063 -0.622309 0.850462
C  -0.821542 1.194943 -0.60652
C  -5.101702 -1.02219 0.75577
C  -5.644429 -2.107972 1.634063
C  -6.080944 -0.435907 -0.213997
C  1.541066 1.399634 -0.831414
C  3.558715 0.810472 0.503185
C  2.432389 -0.891601 -0.547739
C  4.271422 -0.483888 0.799249
C  3.782501 -2.857571 0.066772
C  4.959687 -3.097834 -0.765506
C  5.937757 -3.290352 -1.43512
H  -3.324488 0.284315 -1.071273
H  -1.506118 0.725069 1.387162
H  -3.428924 1.481371 2.5441
H  -3.207537 3.177131 2.121456
H  -4.733104 2.368849 1.763466
H  -2.769404 3.830585 -0.378829
H  -3.096372 2.622564 -1.621711
H  -4.404167 3.226977 -0.620026
H  -3.194641 -1.094012 1.593978
H  -6.01877 -2.944777 1.038021
H  -4.893012 -2.496489 2.321596
H  -6.490839 -1.749742 2.226181
H  -6.954476 -0.043811 0.313663
H  -5.664501 0.373751 -0.811444
H  -6.456186 -1.200342 -0.899889
H  1.324709 1.165052 -1.871497
H  1.940791 2.410242 -0.771016
H  5.287437 -0.454462 0.393963
H  4.336126 -0.652907 1.876743
H  2.926986 -3.407703 -0.326424
H  3.963228 -3.238852 1.074382
H  6.805863 -3.487305 -2.024043
elementType: O N C H
totalener: -1071.54712929 hartree
nucrepener: 1895.68690223 hartree
electener: -2967.23403151 hartree
oneelecener: -5223.85725686 hartree
twoeener: 2256.62322535 hartree
cpcmener: -0.04120140 hartree
kineticenergy: 1066.86514032 hartree
xcener: -102.622251224551 hartree
chargesum: -0.0000000
charge: -0.280991 -0.457684 -0.448083 -0.485591 -0.119560 -0.150016 0.130049 -0.012999 -0.125061 -0.269033 -0.295368 -0.245392 0.414329 -0.041897 -0.229063 -0.248451 0.072080 0.297734 0.386101 -0.002835 -0.052199 -0.427421 0.063877 0.100612 0.093555 0.091363 0.099601 0.096125 0.102185 0.094956 0.095358 0.119608 0.094588 0.089068 0.093734 0.095485 0.086992 0.101051 0.140360 0.129968 0.124201 0.122651 0.131101 0.141916 0.282998
qa: -0.2810 -0.4577 -0.4481 -0.4856 -0.1196 -0.1500 0.1300 -0.0130 -0.1251 -0.2690 -0.2954 -0.2454 0.4143 -0.0419 -0.2291 -0.2485 0.0721 0.2977 0.3861 -0.0028 -0.0522 -0.4274 0.0639 0.1006 0.0936 0.0914 0.0996 0.0961 0.1022 0.0950 0.0954 0.1196 0.0946 0.0891 0.0937 0.0955 0.0870 0.1011 0.1404 0.1300 0.1242 0.1227 0.1311 0.1419 0.2830
va: 2.1059 2.0543 2.0726 2.0385 3.1242 3.1913 3.6795 3.7962 3.8568 3.9078 3.9008 3.8570 4.1816 3.7077 3.9283 3.9376 3.8622 4.2021 4.3084 3.8954 3.8972 3.7386 3.5755 1.0247 1.0356 1.0025 1.0031 1.0015 0.9994 1.0177 1.0006 1.0071 0.9955 1.0076 0.9963 0.9979 1.0082 0.9988 1.0187 1.0102 1.0046 1.0084 1.0070 0.9850 0.9485
dispcorr: -0.020413614 hartree
energy: -1071.567542900058
dipole: -36.88820 37.50179 0.61359 0.82901 -1.78415 -0.95514 7.85479 -6.30107 1.55371
magnitude: 1.92427 au
magnitude: 4.89111 debye
