program: Orca
programVersion: 5.0.2
elementType: O O O O N N C C C C C C C C C C C C C C C C C H H H H H H H H H H H H H H H H H H H H H H
charge: 0
multiplicity: 1
keywords: wb97x-d3
keywords: def2-TZVPP
keywords: def2/J RIJCOSX
keywords: DEFGRID2
keywords: scfconv7
keywords: smallprint printgap noloewdin
keywords: NOSOSCF
formula: C17H22N2O4
InChI: InChI=1/C17H22N2O4/c1-6-7-18-9-13(20)19(16(18)22)10-23-15(21)14-12(8-11(2)3)17(14,4)5/h1,8,12,14H,7,9-10H2,2-5H3
45 atoms
O  0.398512 1.120822 0.749709
O  -0.675396 2.372203 -0.771611
O  1.479349 0.094122 -2.124096
O  3.755592 0.220203 1.817687
N  2.464035 0.473018 -0.088285
N  3.975128 -1.132622 -0.032084
C  -3.127622 1.64295 1.063908
C  -3.168829 0.854253 -0.20925
C  -1.899097 0.863075 0.620748
C  -3.832953 1.114807 2.289713
C  -3.151694 3.149172 0.976142
C  -3.924137 -0.407445 -0.345519
C  -0.700337 1.542243 0.101969
C  -4.78003 -0.717733 -1.32444
C  -5.45963 -2.053896 -1.352757
C  -5.136526 0.186011 -2.466206
C  1.672031 1.585389 0.332719
C  2.287785 -0.186933 -1.275429
C  3.449398 -0.131231 0.701838
C  3.290008 -1.311639 -1.286149
C  4.95648 -2.058947 0.470481
C  4.363748 -3.304479 0.955181
C  3.880153 -4.331656 1.346777
H  -3.108645 1.464484 -1.104006
H  -1.694989 -0.030367 1.200836
H  -4.89666 1.359804 2.251812
H  -3.746395 0.034488 2.399833
H  -3.42231 1.569978 3.193103
H  -2.593844 3.599429 1.800199
H  -2.745078 3.534567 0.043817
H  -4.182876 3.500748 1.049657
H  -3.751877 -1.152165 0.426391
H  -5.255194 -2.577796 -2.290759
H  -5.141267 -2.698415 -0.533311
H  -6.546025 -1.94494 -1.293352
H  -6.221624 0.239835 -2.585483
H  -4.770531 1.204895 -2.353511
H  -4.743612 -0.206056 -3.408479
H  1.592142 2.307285 -0.477298
H  2.157163 2.05846 1.183448
H  2.775366 -2.275001 -1.348921
H  3.96182 -1.223828 -2.14336
H  5.519389 -1.578333 1.271395
H  5.673434 -2.279273 -0.32308
H  3.444531 -5.234502 1.713093
elementType: O N C H
totalener: -1071.54813511 hartree
nucrepener: 1903.31443053 hartree
electener: -2974.86256564 hartree
oneelecener: -5239.29962371 hartree
twoeener: 2264.43705806 hartree
cpcmener: -0.04285989 hartree
kineticenergy: 1066.86616875 hartree
xcener: -102.623681106796 hartree
chargesum: 0.0000000
charge: -0.280236 -0.456377 -0.446282 -0.486326 -0.117297 -0.158196 0.107557 0.050670 -0.124375 -0.264432 -0.277596 -0.284524 0.416012 -0.036521 -0.220325 -0.257283 0.064611 0.296027 0.387402 0.006416 -0.066548 -0.424189 0.069524 0.089941 0.090651 0.097125 0.087278 0.097315 0.098374 0.092911 0.095505 0.117017 0.092468 0.087661 0.093733 0.092563 0.091744 0.099752 0.141921 0.130459 0.125215 0.123050 0.132738 0.141498 0.283372
qa: -0.2802 -0.4564 -0.4463 -0.4863 -0.1173 -0.1582 0.1076 0.0507 -0.1244 -0.2644 -0.2776 -0.2845 0.4160 -0.0365 -0.2203 -0.2573 0.0646 0.2960 0.3874 0.0064 -0.0665 -0.4242 0.0695 0.0899 0.0907 0.0971 0.0873 0.0973 0.0984 0.0929 0.0955 0.1170 0.0925 0.0877 0.0937 0.0926 0.0917 0.0998 0.1419 0.1305 0.1252 0.1230 0.1327 0.1415 0.2834
va: 2.1096 2.0559 2.0737 2.0411 3.1217 3.1909 3.6988 3.7584 3.8461 3.9093 3.9073 3.8831 4.1709 3.7474 3.9241 3.9441 3.8747 4.2010 4.3146 3.8919 3.9025 3.7422 3.5710 1.0343 1.0373 1.0020 1.0058 1.0023 0.9995 1.0183 1.0002 1.0108 0.9954 1.0092 0.9965 0.9979 1.0081 0.9957 1.0179 1.0143 1.0061 1.0068 1.0036 0.9849 0.9479
dispcorr: -0.019833675 hartree
energy: -1071.567968789328
dipole: -34.99880 35.56757 0.56877 -0.80763 -0.79681 -1.60444 -1.18154 1.16815 -0.01339
magnitude: 1.70232 au
magnitude: 4.32696 debye
