program: Orca
programVersion: 5.0.2
elementType: O O O O N N C C C C C C C C C C C C C C C C C H H H H H H H H H H H H H H H H H H H H H H
charge: 0
multiplicity: 1
keywords: wb97x-d3
keywords: def2-TZVPP
keywords: def2/J RIJCOSX
keywords: DEFGRID2
keywords: scfconv7
keywords: smallprint printgap noloewdin
keywords: NOSOSCF
formula: C17H22N2O4
InChI: InChI=1/C17H22N2O4/c1-6-7-18-9-13(20)19(16(18)22)10-23-15(21)14-12(8-11(2)3)17(14,4)5/h1,8,12,14H,7,9-10H2,2-5H3
45 atoms
O  0.09522 0.669374 1.163994
O  0.27562 2.05118 -0.578807
O  3.30004 2.575188 0.028922
O  2.05145 -1.718345 0.918865
N  2.417679 0.554059 0.696518
N  3.644765 -0.845687 -0.497037
C  -2.248811 -0.573129 -0.389968
C  -2.76791 0.340809 0.677597
C  -1.743968 0.860622 -0.306529
C  -3.130637 -0.877274 -1.5763
C  -1.378672 -1.740614 0.006552
C  -4.143226 0.901805 0.642057
C  -0.372917 1.257371 0.059316
C  -5.192199 0.389967 1.291327
C  -6.545931 1.027352 1.212197
C  -5.119862 -0.844898 2.135769
C  1.40327 0.989728 1.607837
C  3.234598 1.375553 -0.042046
C  2.648043 -0.795121 0.413043
C  4.043818 0.468038 -0.931475
C  3.969207 -2.038821 -1.238329
C  3.21158 -2.134402 -2.485731
C  2.585044 -2.17946 -3.509408
H  -2.380642 0.125889 1.669258
H  -2.13522 1.50822 -1.084353
H  -3.831594 -1.678463 -1.332043
H  -3.715295 -0.016946 -1.901354
H  -2.531108 -1.211013 -2.42573
H  -1.998784 -2.6363 0.085847
H  -0.612616 -1.941811 -0.745103
H  -0.887989 -1.607726 0.967105
H  -4.293743 1.793149 0.039469
H  -6.907856 1.30723 2.205324
H  -6.54576 1.923168 0.59103
H  -7.283134 0.332173 0.801437
H  -4.132033 -1.30317 2.14847
H  -5.402789 -0.628303 3.169521
H  -5.827859 -1.596345 1.775907
H  1.52044 2.061042 1.768447
H  1.507931 0.476204 2.560207
H  3.789572 0.657681 -1.97932
H  5.113462 0.643832 -0.799417
H  3.777623 -2.911337 -0.613195
H  5.039122 -2.040939 -1.454756
H  2.025547 -2.223518 -4.417282
elementType: O N C H
totalener: -1071.54463700 hartree
nucrepener: 1976.07318146 hartree
electener: -3047.61781846 hartree
oneelecener: -5384.96306693 hartree
twoeener: 2337.34524847 hartree
cpcmener: -0.04303640 hartree
kineticenergy: 1066.86653973 hartree
xcener: -102.623068815726 hartree
chargesum: 0.0000000
charge: -0.269058 -0.456450 -0.438113 -0.483931 -0.113573 -0.160217 0.157179 0.018159 -0.164395 -0.268123 -0.309459 -0.277530 0.428161 -0.031420 -0.229012 -0.250419 0.062615 0.289391 0.378469 -0.000003 -0.041468 -0.425178 0.050722 0.110125 0.090658 0.094191 0.091331 0.100260 0.096585 0.101410 0.087237 0.120145 0.094241 0.089134 0.093745 0.087252 0.099993 0.095236 0.136305 0.143653 0.124333 0.121455 0.133325 0.139132 0.283908
qa: -0.2691 -0.4564 -0.4381 -0.4839 -0.1136 -0.1602 0.1572 0.0182 -0.1644 -0.2681 -0.3095 -0.2775 0.4282 -0.0314 -0.2290 -0.2504 0.0626 0.2894 0.3785 -0.0000 -0.0415 -0.4252 0.0507 0.1101 0.0907 0.0942 0.0913 0.1003 0.0966 0.1014 0.0872 0.1201 0.0942 0.0891 0.0937 0.0873 0.1000 0.0952 0.1363 0.1437 0.1243 0.1215 0.1333 0.1391 0.2839
va: 2.1045 2.0559 2.0797 2.0363 3.0930 3.1988 3.6230 3.7624 3.9160 3.9100 3.9057 3.8533 4.1819 3.7078 3.9287 3.9419 3.9035 4.2105 4.3229 3.8901 3.9096 3.7440 3.5886 1.0144 1.0337 1.0023 1.0035 1.0021 1.0031 1.0021 1.0199 1.0080 0.9954 1.0078 0.9964 1.0080 0.9985 0.9979 1.0151 0.9977 1.0046 1.0087 1.0030 0.9865 0.9480
dispcorr: -0.022825278 hartree
energy: -1071.567462278931
dipole: -33.50130 33.67926 0.17796 -8.43978 7.00955 -1.43023 1.04671 -1.23344 -0.18673
magnitude: 1.45330 au
magnitude: 3.69400 debye
