program: Gaussian 09
title: 000074792
version: EM64L-G09RevD.01
frameworkgroup: C1[X(C9H12BrN)]
method: RPBEPBE
basis: SDD
operation: Freq
keyword: #p
keyword: freq=noraman
keyword: PBEPBE/SDD
title: #p freq=noraman PBEPBE/SDD
converged: YES YES NO NO
title: Mulliken charges:
elementType: Br N C C C C C C C C C H H H H H H H H H H H H
charge: -0.011833 -0.066191 -0.531005 0.577939 -0.368237 -0.396503 -0.618225 -0.612560 -0.193241 -0.236434 -0.233383 0.239046 0.194537 0.247176 0.181565 0.224622 0.223448 0.187011 0.235971 0.242015 0.248439 0.230751 0.235089
chargesum: 0.00000
title: Mulliken charges with hydrogens summed into heavy atoms:
elementType: Br N C C C C C C C C C
charge: -0.011833 -0.066191 -0.097422 0.577939 -0.368237 -0.154488 0.035139 0.033871 0.055198 -0.005683 0.001706
polarizability: 1.40440459e+02 -1.47249038e+01 1.38329863e+02 9.96300799e+00 6.25294370e+00 7.15505188e+01
1716.lowfreq: -3.0857 -0.0005 -0.0002 -0.0002 4.2362 7.3636 44.9853 48.1921 84.9309
frequency: 44.6299 48.1505 84.9247 143.7252 185.5325 226.1828 234.9661 264.1985 274.1850 312.5410 356.5052 409.9290 419.7487 454.8740 518.8318 605.2800 647.7435 719.2420 757.0488 811.3763 829.5416 875.3549 949.0605 962.6891 987.6410 1004.6403 1026.5484 1038.2397 1045.8411 1089.5896 1112.9178 1133.9837 1165.2283 1174.2050 1211.7037 1253.2989 1263.9243 1294.3111 1358.2796 1374.7010 1418.4700 1420.8529 1442.1173 1455.4201 1460.6102 1464.4539 1474.1711 1476.7582 1485.0026 1572.6012 1599.2194 2835.1244 2837.7194 2858.0073 3017.6221 3024.1996 3027.0146 3076.9639 3085.0347 3121.5420 3138.9221 3156.9102 3172.4583
redmass: 2.9260 3.8917 3.7809 4.3127 2.5070 1.2494 1.2962 5.1590 2.9190 3.4369 3.4441 2.0384 2.4758 3.1303 3.8477 4.7445 6.5045 4.5594 1.2684 3.3656 4.0699 1.4520 1.4329 1.6569 1.3300 6.7350 2.4675 1.5242 2.0478 1.2510 1.5569 1.4304 1.5121 1.1263 2.3237 2.0396 1.9752 1.5193 1.4586 6.0679 1.1488 2.0627 1.1896 1.8938 1.0617 1.1738 1.1021 1.0592 1.0564 6.0108 7.0269 1.0683 1.0583 1.0600 1.0716 1.0822 1.0748 1.1011 1.1009 1.0876 1.0888 1.0947 1.0995
irintensity: 0.6137 0.0640 0.9033 0.5918 0.5857 0.9068 0.9301 1.9238 2.8765 4.4179 2.6377 2.5236 3.2131 5.5717 2.7287 6.6180 18.8187 2.0342 88.2030 17.7842 3.8750 2.6774 2.5089 4.1609 0.1819 59.8781 56.5060 14.1180 5.7035 7.6226 3.1051 5.1875 5.2283 0.8372 4.3714 11.2391 5.5899 7.4568 13.5616 0.5154 5.8932 21.3167 3.8573 20.6427 22.8604 7.1254 20.1672 5.6533 14.5597 14.5813 3.9186 61.1378 75.5535 269.5125 37.5912 29.0404 19.6063 26.4756 39.4995 6.2739 8.3902 19.5715 16.1364
temp: 298.150 k
press: 1.00000 atm
elementType: 35 7 6 6 6 6 6 6 6 6 6 1 1 1 1 1 1 1 1 1 1 1 1
symmnumber: 1
zpe: 492218.5 jmol-1
zpe.correction: 0.187476 hartree
zpe.thermalcorrener: 0.198957 hartree
zpe.thermalcorrenthalpy: 0.199901 hartree
zpe.thermalcorrgfe: 0.148593 hartree
zpe.sumelectzpe: -417.512914 hartree
zpe.sumelectthermal: -417.501433 hartree
zpe.sumelectthermalent: -417.500489 hartree
zpe.sumelectthermalfe: -417.551797 hartree
dipole: -0.0585 -2.2322 -0.4380
dipole: 2.2756
quadrupole: -65.8218 -71.9009 -77.8735
quadrupole: -0.8494 2.9042 0.4240
quadrupole: 6.0436 -0.0355 -6.0081 -0.8494 2.9042 0.4240
hfenergy: -417.70039 hartree
pointgroup: C01 [X(C9H12Br1N1)]
dipole: 0.0106162 -0.8594092 -0.2506529 debye
dipolederiv: -0.1598726 0.2416612 0.0197069 0.2170024 -0.5848538 -0.0758576 0.0036609 -0.0606599 -0.0580746 -0.7292696 -0.036351 -0.0629847 -0.0123365 -0.4972495 -0.0059282 0.0605461 -0.0004998 -0.5075065 0.5005368 0.1570973 -0.1158722 0.1488773 0.2429863 0.133174 -0.1159844 0.1394662 0.437423 0.0178778 0.1213102 0.0469236 0.0017901 -0.3406228 -0.0909086 -0.0340258 -0.0666756 -0.0400841 0.1975236 -0.4804657 -0.0405161 -0.3590877 1.004164 0.1618251 -0.0181703 0.1501781 -0.094266 -0.0130087 -0.0617031 0.0336223 0.0395016 0.0434438 0.0738001 0.0510873 0.0403019 -0.1227262 0.063822 0.1087744 0.0605862 0.1957187 0.4742406 -0.0081576 0.0355673 -0.0102911 0.2730957 0.516851 -0.0347992 0.1577539 -0.1328264 0.2146246 0.0841079 0.2011979 0.1023361 0.2276309 -0.1344348 0.1667586 0.032204 0.1781888 -0.2270175 0.0267362 0.0431968 0.0266158 -0.074028 -0.0683503 -0.0681813 0.0087538 -0.0816502 0.0323145 0.0413554 0.0063577 0.0382803 -0.1337742 0.0537273 0.0151466 0.0806031 -0.0428127 0.027778 0.0366493 0.0539351 0.057327 -0.1203022 0.0129864 0.0244492 -0.0242912 0.0372991 -0.0452661 0.1223419 0.0144719 0.0601298 0.0203406 -0.0550843 -0.0540075 -0.01456 -0.0117739 -0.1095545 -0.2402692 0.0696483 -0.0841965 -0.1291521 -0.084633 0.0866009 -0.1068533 0.0664274 0.032444 0.027819 -0.102128 -0.0157795 0.0821205 0.0103849 -0.1165503 -0.0335691 -0.1255866 -0.2251082 -0.0064262 -0.0972847 -0.1823195 -0.0628006 -0.0167703 -0.0438448 0.1566452 0.0172676 0.0651718 -0.0289926 0.1379407 0.0122164 -0.0744054 -0.0638021 0.0156155 0.0807388 -0.0118855 0.1073011 -0.0034557 0.1563454 -0.0269824 -0.0896175 -0.1802929 0.0039793 -0.0996828 -0.1475638 -0.0506337 -0.1534841 -0.2321122 -0.0854805 -0.0918537 0.0933578 -0.0452745 0.0053837 0.0147687 -0.1285453 0.0953845 -0.0486003 0.1048511 0.0469339 0.0456658 -0.0743355 -0.0676067 -0.0607972 -0.040642 -0.064794 -0.0510138 -0.0762036 0.1037361 0.0593437 -0.0495129 -0.0405625 -0.0679164 -0.0034577 -0.0657584 -0.0444846 -0.0624087 0.1255408 0.0341967 0.0907091 -0.0061587 0.1090251 -0.0642064 -0.0413 -0.0129743 -0.0422046 0.1462463 -0.1007554 0.0329235 -0.070264 0.0283698 0.0726888 -0.0178613 -0.0771767 -0.0180009 0.1355232 unknown
polarizability: 141.5970486|-15.3974332|135.4759286|8.2718595|12.4259268|73.2478631 unknown
InChI: InChI=1S/C9H12BrN/c1-11(2)7-8-5-3-4-6-9(8)10/h3-6H,7H2,1-2H3
charge 0 multiplicity 1
23 atoms
Br -0.007156 2.658024 0.280926
N  -2.214532 -0.119194 0.24821
C  -1.288859 -0.117898 -0.908878
C  0.170977 -0.189197 -0.485413
C  0.874975 0.909482 0.068269
C  0.893818 -1.402087 -0.639269
C  -2.250991 -1.404812 0.967166
C  -3.554858 0.387342 -0.097219
C  2.224638 0.817474 0.467477
C  2.245211 -1.521397 -0.247932
C  2.911647 -0.40826 0.31042
H  -1.464802 0.820244 -1.467484
H  -1.499825 -0.965637 -1.611821
H  -1.235112 -1.681508 1.2977
H  -2.65559 -2.24648 0.345977
H  -2.886206 -1.306431 1.865259
H  -4.172404 0.448317 0.816794
H  -4.101169 -0.252807 -0.837091
H  -3.469885 1.40511 -0.518535
H  0.372283 -2.262608 -1.076052
H  2.733631 1.689171 0.889085
H  2.772735 -2.472239 -0.378344
H  3.959672 -0.482709 0.619755
