program: Orca
programVersion: 5.0.2
elementType: O O O O N N C C C C C C C C C C C C C C C C C H H H H H H H H H H H H H H H H H H H H H H
charge: 0
multiplicity: 1
keywords: wb97x-d3
keywords: def2-TZVPP
keywords: def2/J RIJCOSX
keywords: DEFGRID2
keywords: scfconv7
keywords: smallprint printgap noloewdin
keywords: NOSOSCF
formula: C17H22N2O4
InChI: InChI=1/C17H22N2O4/c1-6-7-18-9-13(20)19(16(18)22)10-23-15(21)14-12(8-11(2)3)17(14,4)5/h1,8,12,14H,7,9-10H2,2-5H3
45 atoms
O  0.26491 0.601538 1.093987
O  -0.825843 -1.328242 1.438337
O  3.632892 2.012781 1.054329
O  1.578395 -1.578058 -0.856524
N  2.428418 0.163865 0.403982
N  3.246445 -0.182385 -1.617241
C  -2.679927 -0.128459 -0.802363
C  -3.342682 -0.033754 0.531972
C  -1.92845 0.500246 0.363402
C  -3.06909 0.823315 -1.908437
C  -2.279194 -1.489201 -1.319139
C  -4.451587 0.899589 0.824123
C  -0.811613 -0.199527 1.016063
C  -5.136371 0.960824 1.971005
C  -6.255857 1.941742 2.147584
C  -4.866932 0.097867 3.165578
C  1.509581 0.053139 1.493771
C  3.377038 1.143274 0.259883
C  2.343765 -0.649553 -0.731593
C  4.032203 0.895809 -1.074559
C  3.574385 -0.849523 -2.850982
C  4.735223 -1.728917 -2.720052
C  5.698579 -2.437867 -2.612193
H  -3.37844 -0.975704 1.069466
H  -1.817248 1.577099 0.304852
H  -2.279941 0.86885 -2.661442
H  -3.979074 0.482251 -2.406525
H  -3.241262 1.840651 -1.558849
H  -2.121408 -2.22103 -0.53015
H  -3.066403 -1.878061 -1.968206
H  -1.364713 -1.429819 -1.913259
H  -4.727895 1.593311 0.035589
H  -6.432253 2.533575 1.24869
H  -7.189419 1.432887 2.403695
H  -6.045994 2.632095 2.969669
H  -5.734619 -0.525285 3.399014
H  -4.006302 -0.558469 3.049224
H  -4.688721 0.716777 4.049047
H  1.89037 0.634127 2.330662
H  1.415405 -0.986932 1.797368
H  3.994727 1.792614 -1.696973
H  5.081712 0.619945 -0.930916
H  3.767365 -0.096524 -3.618149
H  2.707851 -1.420236 -3.18734
H  6.543645 -3.080696 -2.501903
elementType: O N C H
totalener: -1071.54695663 hartree
nucrepener: 1926.51584244 hartree
electener: -2998.06279908 hartree
oneelecener: -5285.71782648 hartree
twoeener: 2287.65502741 hartree
cpcmener: -0.04210479 hartree
kineticenergy: 1066.86662589 hartree
xcener: -102.623461359944 hartree
chargesum: -0.0000000
charge: -0.284440 -0.453559 -0.448240 -0.485608 -0.116683 -0.150734 0.134922 -0.039241 -0.055713 -0.294290 -0.274078 -0.251684 0.378410 -0.027561 -0.229996 -0.255983 0.071171 0.298139 0.390603 -0.004710 -0.060215 -0.426003 0.067706 0.102175 0.093440 0.098286 0.104372 0.088543 0.095725 0.097624 0.091044 0.118367 0.087678 0.093125 0.094200 0.097062 0.085220 0.094263 0.127699 0.143180 0.122548 0.125643 0.140525 0.133367 0.283703
qa: -0.2844 -0.4536 -0.4482 -0.4856 -0.1167 -0.1507 0.1349 -0.0392 -0.0557 -0.2943 -0.2741 -0.2517 0.3784 -0.0276 -0.2300 -0.2560 0.0712 0.2981 0.3906 -0.0047 -0.0602 -0.4260 0.0677 0.1022 0.0934 0.0983 0.1044 0.0885 0.0957 0.0976 0.0910 0.1184 0.0877 0.0931 0.0942 0.0971 0.0852 0.0943 0.1277 0.1432 0.1225 0.1256 0.1405 0.1334 0.2837
va: 2.1072 2.0539 2.0724 2.0348 3.1167 3.1858 3.7509 3.8331 3.7902 3.9168 3.8828 3.8910 4.1810 3.7313 3.9289 3.9442 3.8795 4.1996 4.2985 3.8952 3.9077 3.7390 3.5702 1.0193 1.0318 1.0014 0.9987 1.0035 1.0169 1.0020 1.0092 1.0088 1.0081 0.9956 0.9959 0.9970 1.0150 0.9975 1.0143 1.0175 1.0089 1.0029 0.9856 1.0027 0.9476
dispcorr: -0.020757577 hartree
energy: -1071.567714210219
dipole: -32.70369 33.38271 0.67902 3.57236 -2.54984 1.02252 -0.22351 -1.33138 -1.55489
magnitude: 1.98099 au
magnitude: 5.03527 debye
