program: Orca
programVersion: 5.0.2
elementType: O O O O N N C C C C C C C C C C C C C C C C C H H H H H H H H H H H H H H H H H H H H H H
charge: 0
multiplicity: 1
keywords: wb97x-d3
keywords: def2-TZVPP
keywords: def2/J RIJCOSX
keywords: DEFGRID2
keywords: scfconv7
keywords: smallprint printgap noloewdin
keywords: NOSOSCF
formula: C17H22N2O4
InChI: InChI=1/C17H22N2O4/c1-6-7-18-9-13(20)19(16(18)22)10-23-15(21)14-12(8-11(2)3)17(14,4)5/h1,8,12,14H,7,9-10H2,2-5H3
45 atoms
O  0.199706 1.20537 0.26239
O  -0.772127 0.82107 2.246841
O  3.42169 2.370988 -1.139138
O  1.901172 -1.266181 1.1422
N  2.465113 0.769532 0.20666
N  3.651474 -1.01039 -0.33877
C  -2.435372 -1.164235 0.423637
C  -3.267462 0.003061 0.831651
C  -1.905208 0.25144 0.217753
C  -2.772808 -1.908261 -0.845347
C  -1.848353 -2.054607 1.49128
C  -4.5018 0.396772 0.103364
C  -0.804429 0.772609 1.042218
C  -4.995395 1.636748 0.052954
C  -6.270017 1.941228 -0.672817
C  -4.334661 2.812566 0.703081
C  1.445012 1.534768 0.853464
C  3.344327 1.23883 -0.733961
C  2.60609 -0.607321 0.411574
C  4.185538 0.057559 -1.144251
C  4.032862 -2.388759 -0.513308
C  3.602513 -2.925397 -1.803366
C  3.246618 -3.349455 -2.869251
H  -3.29303 0.178032 1.904858
H  -1.888883 0.581186 -0.814935
H  -1.889562 -2.421175 -1.231056
H  -3.536342 -2.66655 -0.658225
H  -3.141095 -1.252154 -1.634147
H  -1.670378 -1.538781 2.432565
H  -2.537777 -2.875648 1.698585
H  -0.904268 -2.494213 1.163574
H  -5.051809 -0.397393 -0.393883
H  -6.107035 2.680538 -1.461715
H  -6.706575 1.05302 -1.129742
H  -7.013911 2.371885 0.002925
H  -3.411033 2.558666 1.221039
H  -4.101437 3.581772 -0.038351
H  -5.006043 3.280762 1.427922
H  1.648141 2.591397 0.690473
H  1.450028 1.333307 1.922672
H  4.071874 -0.130646 -2.215894
H  5.242136 0.246088 -0.937901
H  3.605014 -2.97793 0.298423
H  5.118021 -2.476866 -0.424375
H  2.946042 -3.726998 -3.821146
elementType: O N C H
totalener: -1071.54647906 hartree
nucrepener: 1943.21043893 hartree
electener: -3014.75691799 hartree
oneelecener: -5319.16868961 hartree
twoeener: 2304.41177162 hartree
cpcmener: -0.04000383 hartree
kineticenergy: 1066.86003551 hartree
xcener: -102.622101882907 hartree
chargesum: 0.0000000
charge: -0.282214 -0.455564 -0.448569 -0.488876 -0.114317 -0.148685 0.157497 -0.032071 -0.095143 -0.289659 -0.276324 -0.281637 0.380879 -0.015785 -0.227102 -0.242005 0.067160 0.298993 0.390861 -0.002591 -0.050039 -0.426413 0.059920 0.104120 0.093527 0.098070 0.099200 0.092314 0.094664 0.098071 0.091978 0.122084 0.094312 0.088692 0.094690 0.080131 0.096423 0.099721 0.126620 0.144238 0.124021 0.122977 0.131093 0.141224 0.283512
qa: -0.2822 -0.4556 -0.4486 -0.4889 -0.1143 -0.1487 0.1575 -0.0321 -0.0951 -0.2897 -0.2763 -0.2816 0.3809 -0.0158 -0.2271 -0.2420 0.0672 0.2990 0.3909 -0.0026 -0.0500 -0.4264 0.0599 0.1041 0.0935 0.0981 0.0992 0.0923 0.0947 0.0981 0.0920 0.1221 0.0943 0.0887 0.0947 0.0801 0.0964 0.0997 0.1266 0.1442 0.1240 0.1230 0.1311 0.1412 0.2835
va: 2.1027 2.0494 2.0731 2.0291 3.1142 3.1930 3.7117 3.8385 3.8016 3.9101 3.8813 3.8871 4.1609 3.7099 3.9295 3.9390 3.8741 4.2008 4.2969 3.8960 3.8982 3.7462 3.5807 1.0244 1.0316 1.0034 0.9994 1.0013 1.0166 1.0020 1.0103 1.0028 0.9965 1.0066 0.9962 1.0161 0.9985 0.9993 1.0144 1.0162 1.0068 1.0064 1.0071 0.9849 0.9482
dispcorr: -0.021320228 hartree
energy: -1071.567799284136
dipole: -30.15320 31.18160 1.02841 -2.24551 1.40996 -0.83555 -2.28633 0.81104 -1.47529
magnitude: 1.98299 au
magnitude: 5.04035 debye
