program: Orca
programVersion: 5.0.2
elementType: O O O O N N C C C C C C C C C C C C C C C C C H H H H H H H H H H H H H H H H H H H H H H
charge: 0
multiplicity: 1
keywords: wb97x-d3
keywords: def2-TZVPP
keywords: def2/J RIJCOSX
keywords: DEFGRID2
keywords: scfconv7
keywords: smallprint printgap noloewdin
keywords: NOSOSCF
formula: C17H22N2O4
InChI: InChI=1/C17H22N2O4/c1-6-7-18-9-13(20)19(16(18)22)10-23-15(21)14-12(8-11(2)3)17(14,4)5/h1,8,12,14H,7,9-10H2,2-5H3
45 atoms
O  0.414719 1.556291 1.203595
O  -0.113078 1.82812 -0.95151
O  2.90298 1.494472 -1.808411
O  1.829412 -1.116608 1.769508
N  2.233355 0.480423 0.147494
N  2.535751 -1.647118 -0.358831
C  -3.026958 2.23417 0.073979
C  -2.850162 0.771681 -0.183953
C  -1.838478 1.517601 0.685018
C  -4.074481 2.703124 1.056815
C  -2.848645 3.192907 -1.078813
C  -3.690161 -0.269012 0.43554
C  -0.460828 1.661134 0.191706
C  -3.999586 -1.462773 -0.083112
C  -4.871298 -2.419106 0.674643
C  -3.53773 -1.971465 -1.414202
C  1.798033 1.614391 0.906534
C  2.706969 0.512567 -1.139575
C  2.168492 -0.825285 0.64546
C  2.959178 -0.921779 -1.527633
C  2.725985 -3.065447 -0.203416
C  4.13186 -3.42304 -0.023968
C  5.293344 -3.69888 0.107323
H  -2.475506 0.54753 -1.176746
H  -1.914111 1.333882 1.750763
H  -5.061862 2.710822 0.590452
H  -4.134055 2.084156 1.950977
H  -3.856299 3.721961 1.382717
H  -2.424654 4.140858 -0.741146
H  -2.214446 2.804095 -1.871441
H  -3.823674 3.410542 -1.519702
H  -4.085543 -0.037486 1.419952
H  -4.345985 -3.357799 0.871031
H  -5.197993 -2.011467 1.631429
H  -5.763121 -2.68101 0.098636
H  -3.004923 -2.918428 -1.295369
H  -4.392256 -2.180305 -2.063099
H  -2.878344 -1.289072 -1.946456
H  2.059848 2.518461 0.357428
H  2.29439 1.633226 1.873635
H  2.378775 -1.18727 -2.414684
H  4.01952 -1.070457 -1.752359
H  2.326694 -3.57773 -1.081342
H  2.140281 -3.409166 0.649859
H  6.320672 -3.954874 0.240554
elementType: O N C H
totalener: -1071.54753535 hartree
nucrepener: 1954.68987603 hartree
electener: -3026.23741139 hartree
oneelecener: -5342.04003975 hartree
twoeener: 2315.80262836 hartree
cpcmener: -0.04336626 hartree
kineticenergy: 1066.87255322 hartree
xcener: -102.625671951601 hartree
chargesum: 0.0000000
charge: -0.283229 -0.462782 -0.442439 -0.484851 -0.126931 -0.154994 0.109189 0.018112 -0.091716 -0.279582 -0.275984 -0.263363 0.407897 -0.048643 -0.217104 -0.251584 0.080747 0.297338 0.377423 -0.001879 -0.055308 -0.425281 0.061655 0.103123 0.088816 0.099273 0.090294 0.096814 0.097854 0.093356 0.094295 0.115025 0.092778 0.087495 0.092459 0.093964 0.096588 0.089367 0.132890 0.148051 0.120908 0.124619 0.140815 0.131081 0.283440
qa: -0.2832 -0.4628 -0.4424 -0.4849 -0.1269 -0.1550 0.1092 0.0181 -0.0917 -0.2796 -0.2760 -0.2634 0.4079 -0.0486 -0.2171 -0.2516 0.0807 0.2973 0.3774 -0.0019 -0.0553 -0.4253 0.0617 0.1031 0.0888 0.0993 0.0903 0.0968 0.0979 0.0934 0.0943 0.1150 0.0928 0.0875 0.0925 0.0940 0.0966 0.0894 0.1329 0.1481 0.1209 0.1246 0.1408 0.1311 0.2834
va: 2.1144 2.0495 2.0775 2.0400 3.0970 3.1902 3.6938 3.8043 3.8004 3.9160 3.8964 3.8892 4.1601 3.7689 3.9209 3.9384 3.8906 4.2071 4.3301 3.8927 3.9044 3.7425 3.5730 1.0220 1.0354 1.0004 1.0068 1.0015 0.9999 1.0209 0.9997 1.0124 0.9966 1.0091 0.9960 0.9971 0.9968 1.0118 1.0179 0.9934 1.0084 1.0048 0.9853 1.0058 0.9482
dispcorr: -0.020611470 hartree
energy: -1071.568146824703
dipole: -31.82515 31.48901 -0.33614 -2.21254 0.83047 -1.38206 -1.99861 1.83753 -0.16107
magnitude: 1.43145 au
magnitude: 3.63845 debye
