program: Orca
programVersion: 5.0.2
elementType: O O O O N N C C C C C C C C C C C C C C C C C H H H H H H H H H H H H H H H H H H H H H H
charge: 0
multiplicity: 1
keywords: wb97x-d3
keywords: def2-TZVPP
keywords: def2/J RIJCOSX
keywords: DEFGRID2
keywords: scfconv7
keywords: smallprint printgap noloewdin
keywords: NOSOSCF
formula: C17H22N2O4
InChI: InChI=1/C17H22N2O4/c1-6-7-18-9-13(20)19(16(18)22)10-23-15(21)14-12(8-11(2)3)17(14,4)5/h1,8,12,14H,7,9-10H2,2-5H3
45 atoms
O  -0.286895 -0.796049 0.097447
O  -1.65985 -0.691197 -1.672688
O  1.449472 0.99641 -1.763383
O  3.028118 -2.337927 0.908964
N  1.942732 -0.846505 -0.491275
N  3.947288 -0.324794 0.266447
C  -2.522834 1.956363 -0.180407
C  -3.579526 0.911105 -0.077397
C  -2.155079 0.557466 0.303915
C  -2.442673 3.034949 0.872048
C  -2.092225 2.432987 -1.545486
C  -4.648125 0.950653 0.9534
C  -1.380885 -0.358613 -0.547579
C  -5.339472 -0.110533 1.377936
C  -6.436553 0.026604 2.388828
C  -5.090283 -1.504542 0.89156
C  0.692353 -1.527428 -0.622457
C  2.200457 0.374411 -1.053626
C  3.002799 -1.287224 0.310456
C  3.582912 0.763402 -0.60334
C  5.270215 -0.472317 0.817624
C  6.271088 -0.736242 -0.214887
C  7.084724 -0.933081 -1.075265
H  -3.880685 0.487782 -1.032541
H  -1.933995 0.488135 1.363088
H  -3.118827 3.858962 0.633605
H  -2.696355 2.673086 1.868578
H  -1.431686 3.444054 0.919991
H  -2.693418 3.297144 -1.83594
H  -1.046956 2.748648 -1.540573
H  -2.213058 1.680836 -2.322177
H  -4.900671 1.924893 1.362312
H  -7.388266 -0.330657 1.986057
H  -6.23141 -0.578084 3.276281
H  -6.574968 1.059159 2.709848
H  -4.877336 -2.172983 1.73002
H  -5.979257 -1.907162 0.398108
H  -4.260312 -1.575896 0.190064
H  0.786265 -2.519732 -0.186147
H  0.428975 -1.624454 -1.673806
H  4.250964 0.85339 -1.465221
H  3.563828 1.7235 -0.081803
H  5.259932 -1.282928 1.547124
H  5.537579 0.435474 1.363552
H  7.80876 -1.113366 -1.838311
elementType: O N C H
totalener: -1071.54633402 hartree
nucrepener: 1917.99348832 hartree
electener: -2989.53982234 hartree
oneelecener: -5268.54659377 hartree
twoeener: 2279.00677144 hartree
cpcmener: -0.03953573 hartree
kineticenergy: 1066.86864802 hartree
xcener: -102.623837955019 hartree
chargesum: -0.0000000
charge: -0.283017 -0.456287 -0.452228 -0.486040 -0.113123 -0.156315 0.156662 -0.037975 -0.087112 -0.291264 -0.275159 -0.279324 0.382086 -0.015513 -0.227705 -0.242664 0.068038 0.299495 0.384466 0.007558 -0.050931 -0.425833 0.061117 0.102877 0.093533 0.099974 0.091680 0.097917 0.098250 0.091479 0.095699 0.123130 0.094655 0.094016 0.088783 0.095153 0.099850 0.079707 0.128822 0.144125 0.124221 0.122950 0.130337 0.140782 0.283126
qa: -0.2830 -0.4563 -0.4522 -0.4860 -0.1131 -0.1563 0.1567 -0.0380 -0.0871 -0.2913 -0.2752 -0.2793 0.3821 -0.0155 -0.2277 -0.2427 0.0680 0.2995 0.3845 0.0076 -0.0509 -0.4258 0.0611 0.1029 0.0935 0.1000 0.0917 0.0979 0.0983 0.0915 0.0957 0.1231 0.0947 0.0940 0.0888 0.0952 0.0999 0.0797 0.1288 0.1441 0.1242 0.1230 0.1303 0.1408 0.2831
va: 2.1029 2.0469 2.0641 2.0430 3.1205 3.1951 3.7173 3.8407 3.8040 3.9120 3.8794 3.8842 4.1588 3.7100 3.9293 3.9410 3.8691 4.1882 4.3159 3.8900 3.8997 3.7355 3.5796 1.0253 1.0317 0.9991 1.0012 1.0032 1.0023 1.0087 1.0164 1.0025 0.9957 0.9967 1.0068 0.9987 0.9987 1.0162 1.0167 1.0154 1.0056 1.0089 1.0078 0.9852 0.9483
dispcorr: -0.021037497 hartree
energy: -1071.567371514727
dipole: -29.57241 30.84725 1.27485 10.87265 -9.72536 1.14729 7.57028 -6.47950 1.09078
magnitude: 2.03256 au
magnitude: 5.16637 debye
