program: Orca
programVersion: 5.0.2
elementType: O O O O N N C C C C C C C C C C C C C C C C C H H H H H H H H H H H H H H H H H H H H H H
charge: 0
multiplicity: 1
keywords: wb97x-d3
keywords: def2-TZVPP
keywords: def2/J RIJCOSX
keywords: DEFGRID2
keywords: scfconv7
keywords: smallprint printgap noloewdin
keywords: NOSOSCF
formula: C17H22N2O4
InChI: InChI=1/C17H22N2O4/c1-6-7-18-9-13(20)19(16(18)22)10-23-15(21)14-12(8-11(2)3)17(14,4)5/h1,8,12,14H,7,9-10H2,2-5H3
45 atoms
O  0.477681 1.435283 1.098882
O  -0.206984 1.5997 -1.023361
O  2.784354 1.430505 -2.05682
O  2.178643 -1.05026 1.719861
N  2.32948 0.478118 -0.009291
N  2.807954 -1.638547 -0.416799
C  -3.014913 2.024118 0.337838
C  -2.898364 0.59976 -0.111278
C  -1.794051 1.206479 0.731845
C  -3.964052 2.364094 1.461135
C  -2.908492 3.116795 -0.696314
C  -3.715079 -0.492113 0.466013
C  -0.464433 1.436445 0.143615
C  -4.601919 -1.243356 -0.193974
C  -5.351087 -2.339798 0.501594
C  -4.941113 -1.077346 -1.643502
C  1.831221 1.606887 0.717195
C  2.725673 0.477627 -1.322958
C  2.421756 -0.796193 0.562397
C  3.099223 -0.946995 -1.645283
C  3.142182 -3.021267 -0.19204
C  4.571826 -3.227616 0.033589
C  5.749366 -3.38876 0.2058
H  -2.642699 0.490644 -1.160628
H  -1.771878 0.901752 1.77254
H  -3.980718 1.608276 2.24588
H  -3.687185 3.313261 1.924246
H  -4.982282 2.467653 1.079915
H  -2.461629 4.018861 -0.273333
H  -2.325509 2.829339 -1.568067
H  -3.907439 3.382044 -1.047825
H  -3.567903 -0.694221 1.523213
H  -5.16245 -3.306225 0.026094
H  -5.077372 -2.425084 1.553386
H  -6.43067 -2.175676 0.44617
H  -6.003043 -0.844816 -1.759745
H  -4.378238 -0.288756 -2.139697
H  -4.770364 -2.007488 -2.192001
H  1.974912 2.500854 0.111158
H  2.375332 1.722745 1.651324
H  2.504716 -1.319525 -2.482706
H  4.156401 -1.006734 -1.919476
H  2.819039 -3.606201 -1.055605
H  2.572834 -3.390217 0.661931
H  6.793836 -3.540124 0.365921
elementType: O N C H
totalener: -1071.54779175 hartree
nucrepener: 1934.61035964 hartree
electener: -3006.15815138 hartree
oneelecener: -5301.95154848 hartree
twoeener: 2295.79339710 hartree
cpcmener: -0.04340064 hartree
kineticenergy: 1066.86382036 hartree
xcener: -102.622636808581 hartree
chargesum: 0.0000000
charge: -0.281281 -0.461098 -0.442395 -0.484471 -0.127650 -0.157039 0.135118 0.023393 -0.138104 -0.259932 -0.286319 -0.274161 0.417502 -0.037174 -0.223258 -0.250714 0.079469 0.297413 0.380033 -0.003723 -0.062049 -0.425040 0.066938 0.095698 0.088588 0.088038 0.098238 0.096311 0.099079 0.094172 0.094291 0.119079 0.093790 0.088550 0.092973 0.096114 0.089087 0.094786 0.132868 0.148222 0.121650 0.126267 0.140163 0.133273 0.283301
qa: -0.2813 -0.4611 -0.4424 -0.4845 -0.1277 -0.1570 0.1351 0.0234 -0.1381 -0.2599 -0.2863 -0.2742 0.4175 -0.0372 -0.2233 -0.2507 0.0795 0.2974 0.3800 -0.0037 -0.0620 -0.4250 0.0669 0.0957 0.0886 0.0880 0.0982 0.0963 0.0991 0.0942 0.0943 0.1191 0.0938 0.0886 0.0930 0.0961 0.0891 0.0948 0.1329 0.1482 0.1217 0.1263 0.1402 0.1333 0.2833
va: 2.1151 2.0511 2.0772 2.0400 3.0988 3.1884 3.6748 3.7673 3.8827 3.9068 3.9034 3.8745 4.1505 3.7358 3.9239 3.9444 3.8916 4.2058 4.3269 3.8932 3.9077 3.7427 3.5705 1.0283 1.0399 1.0043 1.0024 1.0028 0.9994 1.0192 1.0006 1.0093 0.9959 1.0086 0.9964 0.9973 1.0091 0.9976 1.0177 0.9939 1.0082 1.0038 0.9857 1.0026 0.9481
dispcorr: -0.020630565 hartree
energy: -1071.568422310645
dipole: -35.23875 34.91524 -0.32351 -0.75622 -0.50471 -1.26093 -0.79476 0.68434 -0.11043
magnitude: 1.30644 au
magnitude: 3.32072 debye
