program: Orca
programVersion: 5.0.2
elementType: O O O O N N C C C C C C C C C C C C C C C C C H H H H H H H H H H H H H H H H H H H H H H
charge: 0
multiplicity: 1
keywords: wb97x-d3
keywords: def2-TZVPP
keywords: def2/J RIJCOSX
keywords: DEFGRID2
keywords: scfconv7
keywords: smallprint printgap noloewdin
keywords: NOSOSCF
formula: C17H22N2O4
InChI: InChI=1/C17H22N2O4/c1-6-7-18-9-13(20)19(16(18)22)10-23-15(21)14-12(8-11(2)3)17(14,4)5/h1,8,12,14H,7,9-10H2,2-5H3
45 atoms
O  0.430314 1.68411 0.325509
O  -0.626987 2.34662 -1.541966
O  3.785584 1.288113 1.726491
O  1.430861 -0.526338 -1.726034
N  2.484327 0.716549 -0.085849
N  3.115212 -1.382357 -0.404352
C  -3.202249 2.035935 0.199265
C  -3.003888 0.78588 -0.589356
C  -1.85739 1.328822 0.24052
C  -3.998559 1.962832 1.480996
C  -3.367237 3.348924 -0.525582
C  -3.675676 -0.485357 -0.21498
C  -0.66283 1.848935 -0.451082
C  -3.099769 -1.681945 -0.087182
C  -3.905622 -2.8885 0.293139
C  -1.640382 -1.940558 -0.306995
C  1.702846 1.906006 -0.242201
C  3.40557 0.496403 0.911533
C  2.244857 -0.431425 -0.847432
C  3.841861 -0.948115 0.75758
C  2.989043 -2.765787 -0.780022
C  2.281023 -3.556781 0.225335
C  1.714672 -4.191023 1.071427
H  -2.879811 0.947803 -1.65793
H  -1.6452 0.800721 1.162834
H  -3.861562 1.015788 2.002855
H  -3.706659 2.765033 2.160723
H  -5.065483 2.075853 1.277061
H  -2.837937 3.37971 -1.473896
H  -4.426193 3.521153 -0.727736
H  -3.011492 4.180329 0.086111
H  -4.748842 -0.416482 -0.055351
H  -4.954532 -2.648133 0.46207
H  -3.856208 -3.652894 -0.48608
H  -3.51482 -3.348627 1.204402
H  -1.105369 -1.092525 -0.724202
H  -1.147627 -2.225914 0.627047
H  -1.501269 -2.780044 -0.991984
H  1.624805 2.164328 -1.296825
H  2.201557 2.707228 0.300833
H  4.925361 -1.012657 0.629247
H  3.571168 -1.513247 1.655976
H  3.981832 -3.190056 -0.950047
H  2.457893 -2.809251 -1.731533
H  1.201889 -4.759857 1.80959
totalener: -1071.51784968 hartree
nucrepener: 1989.56401734 hartree
electener: -3061.08186702 hartree
oneelecener: -5411.27384305 hartree
twoeener: 2350.19197603 hartree
kineticenergy: 1066.93475259 hartree
xcener: -102.625618412932 hartree
chargesum: -0.0000000
charge: -0.274991 -0.375411 -0.341561 -0.379759 -0.135134 -0.166249 0.127021 0.001594 -0.149252 -0.264572 -0.262928 -0.250679 0.360465 0.006721 -0.215058 -0.220000 0.062398 0.236170 0.339226 -0.029519 -0.080802 -0.392235 0.087171 0.105944 0.093192 0.084979 0.091932 0.087996 0.103866 0.081569 0.084615 0.091732 0.078447 0.088394 0.080947 0.097035 0.078342 0.087439 0.144324 0.116322 0.104164 0.109996 0.124065 0.133249 0.248838
qa: -0.2750 -0.3754 -0.3416 -0.3798 -0.1351 -0.1662 0.1270 0.0016 -0.1493 -0.2646 -0.2629 -0.2507 0.3605 0.0067 -0.2151 -0.2200 0.0624 0.2362 0.3392 -0.0295 -0.0808 -0.3922 0.0872 0.1059 0.0932 0.0850 0.0919 0.0880 0.1039 0.0816 0.0846 0.0917 0.0784 0.0884 0.0809 0.0970 0.0783 0.0874 0.1443 0.1163 0.1042 0.1100 0.1241 0.1332 0.2488
va: 2.0973 2.1286 2.1779 2.1359 3.1093 3.1305 3.7284 3.7998 3.8671 3.9058 3.9072 3.9012 4.1646 3.7620 3.9403 3.9333 3.8938 4.2552 4.3358 3.8938 3.9252 3.7762 3.6576 1.0252 1.0286 1.0065 1.0061 1.0027 1.0217 1.0018 1.0018 1.0106 1.0104 0.9987 0.9990 1.0151 1.0009 1.0049 1.0144 1.0110 1.0090 1.0100 0.9851 1.0055 0.9712
dispcorr: -0.022966458 hartree
energy: -1071.540816138277
dipole: -26.91889 27.31861 0.39971 -5.41113 4.05014 -1.36100 3.66964 -3.09632 0.57332
magnitude: 1.52996 au
magnitude: 3.88885 debye
