program: Orca
programVersion: 5.0.2
elementType: O O O O N N C C C C C C C C C C C C C C C C C H H H H H H H H H H H H H H H H H H H H H H
charge: 0
multiplicity: 1
keywords: wb97x-d3
keywords: def2-TZVPP
keywords: def2/J RIJCOSX
keywords: DEFGRID2
keywords: scfconv7
keywords: smallprint printgap noloewdin
keywords: NOSOSCF
formula: C17H22N2O4
InChI: InChI=1/C17H22N2O4/c1-6-7-18-9-13(20)19(16(18)22)10-23-15(21)14-12(8-11(2)3)17(14,4)5/h1,8,12,14H,7,9-10H2,2-5H3
45 atoms
O  0.126012 0.98948 1.500005
O  -0.406197 -0.919098 0.456964
O  1.948521 2.229219 -0.595141
O  2.671888 -1.972481 1.02635
N  2.153477 0.231966 0.528181
N  3.045173 -1.04013 -1.045871
C  -2.416395 1.217266 -0.831843
C  -3.124504 0.129099 -0.092595
C  -1.997665 0.864983 0.586881
C  -3.090181 2.558199 -0.993791
C  -1.521765 0.854576 -1.992272
C  -4.525074 0.285076 0.378945
C  -0.710064 0.183703 0.826324
C  -5.011367 -0.190948 1.52582
C  -6.451147 -0.005829 1.898317
C  -4.184956 -0.943723 2.523187
C  1.446152 0.54689 1.733846
C  2.280895 1.077664 -0.544694
C  2.626707 -1.060782 0.247477
C  2.90842 0.253162 -1.651284
C  3.706227 -2.149392 -1.676819
C  5.084048 -1.839117 -2.050869
C  6.203404 -1.563006 -2.381427
H  -2.855746 -0.876062 -0.40974
H  -2.265925 1.601795 1.335783
H  -3.713231 2.816918 -0.13779
H  -2.345621 3.346514 -1.113453
H  -3.726318 2.565756 -1.881471
H  -0.704759 1.572612 -2.091514
H  -1.092051 -0.140943 -1.896101
H  -2.094543 0.874484 -2.921247
H  -5.205539 0.802655 -0.291403
H  -6.999542 0.562349 1.148064
H  -6.951129 -0.969603 2.021754
H  -6.545608 0.517439 2.853147
H  -4.137158 -0.404997 3.473198
H  -4.638023 -1.913647 2.742033
H  -3.166723 -1.123904 2.18573
H  1.925866 1.37727 2.247264
H  1.47262 -0.34145 2.366368
H  2.25349 0.243937 -2.527926
H  3.870205 0.680294 -1.95132
H  3.152352 -2.459451 -2.568453
H  3.683972 -2.990527 -0.982631
H  7.202294 -1.331712 -2.664043
totalener: -1071.51567737 hartree
nucrepener: 1975.11528466 hartree
electener: -3046.63096203 hartree
oneelecener: -5382.39041698 hartree
twoeener: 2335.75945495 hartree
kineticenergy: 1066.94158798 hartree
xcener: -102.629099711662 hartree
chargesum: 0.0000000
charge: -0.252502 -0.375688 -0.337438 -0.379721 -0.146300 -0.150039 0.155535 -0.011494 -0.123409 -0.282271 -0.289991 -0.245845 0.336349 -0.006172 -0.211186 -0.224700 0.079888 0.194408 0.355621 -0.016672 -0.090947 -0.401551 0.105430 0.106466 0.086237 0.084619 0.100449 0.089435 0.096327 0.091239 0.090925 0.093538 0.078463 0.087458 0.084263 0.086893 0.089879 0.082986 0.122521 0.133337 0.099251 0.111111 0.125623 0.130155 0.247520
qa: -0.2525 -0.3757 -0.3374 -0.3797 -0.1463 -0.1500 0.1555 -0.0115 -0.1234 -0.2823 -0.2900 -0.2458 0.3363 -0.0062 -0.2112 -0.2247 0.0799 0.1944 0.3556 -0.0167 -0.0909 -0.4016 0.1054 0.1065 0.0862 0.0846 0.1004 0.0894 0.0963 0.0912 0.0909 0.0935 0.0785 0.0875 0.0843 0.0869 0.0899 0.0830 0.1225 0.1333 0.0993 0.1111 0.1256 0.1302 0.2475
va: 2.1298 2.1231 2.1740 2.1497 3.1000 3.1320 3.7296 3.8153 3.8287 3.9069 3.8927 3.9043 4.2116 3.7329 3.9425 3.9375 3.9161 4.2791 4.3267 3.9011 3.9153 3.7886 3.6229 1.0241 1.0309 1.0051 1.0050 1.0007 1.0073 1.0149 1.0065 1.0095 1.0097 0.9988 0.9992 1.0004 1.0025 1.0208 0.9923 1.0155 1.0066 1.0108 0.9831 1.0123 0.9713
dispcorr: -0.022877623 hartree
energy: -1071.538554990030
dipole: -30.99543 30.94007 -0.05536 4.07407 -3.84044 0.23363 -0.96031 0.33865 -0.62166
magnitude: 0.66641 au
magnitude: 1.69388 debye
