program: Orca
programVersion: 5.0.2
elementType: O O O O N N C C C C C C C C C C C C C C C C C H H H H H H H H H H H H H H H H H H H H H H
charge: 0
multiplicity: 1
keywords: wb97x-d3
keywords: def2-TZVPP
keywords: def2/J RIJCOSX
keywords: DEFGRID2
keywords: scfconv7
keywords: smallprint printgap noloewdin
keywords: NOSOSCF
formula: C17H22N2O4
InChI: InChI=1/C17H22N2O4/c1-6-7-18-9-13(20)19(16(18)22)10-23-15(21)14-12(8-11(2)3)17(14,4)5/h1,8,12,14H,7,9-10H2,2-5H3
45 atoms
O  0.024793 0.113199 -0.276807
O  -1.212722 1.571998 -1.424496
O  1.854149 -2.398271 -1.683042
O  3.136964 1.301518 0.651063
N  2.229005 -0.362562 -0.677692
N  3.976968 -0.843402 0.591744
C  -2.938946 1.499416 1.21496
C  -3.599745 0.716481 0.121831
C  -2.149633 0.439148 0.4677
C  -3.259536 1.189143 2.657904
C  -2.666515 2.965556 0.981379
C  -4.62421 -0.314378 0.367997
C  -1.105514 0.790385 -0.515961
C  -5.712976 -0.550371 -0.368445
C  -6.669519 -1.644099 0.004611
C  -6.095343 0.209892 -1.602064
C  1.104864 0.362813 -1.163331
C  2.48361 -1.686214 -0.954411
C  3.132661 0.169493 0.251395
C  3.725717 -2.040995 -0.161179
C  5.181973 -0.624443 1.346119
C  6.378262 -0.658595 0.506968
C  7.346884 -0.712315 -0.198475
H  -3.709571 1.274456 -0.800997
H  -1.945133 -0.463899 1.03206
H  -2.466348 1.557342 3.310508
H  -4.189301 1.677571 2.954746
H  -3.371507 0.123454 2.852376
H  -3.525204 3.552786 1.31199
H  -1.800013 3.296972 1.557012
H  -2.484726 3.203615 -0.063616
H  -4.465303 -0.948172 1.235211
H  -7.671433 -1.246176 0.184632
H  -6.765461 -2.373433 -0.803738
H  -6.356323 -2.178084 0.900853
H  -5.408097 1.01291 -1.8552
H  -6.149828 -0.459888 -2.463632
H  -7.088889 0.650292 -1.488642
H  0.86473 0.019338 -2.169647
H  1.351766 1.423534 -1.191628
H  3.535529 -2.908864 0.475812
H  4.548294 -2.290872 -0.839439
H  5.266464 -1.377666 2.134398
H  5.097342 0.343912 1.840819
H  8.208474 -0.741733 -0.821269
totalener: -1071.52128701 hartree
nucrepener: 1876.03256590 hartree
electener: -2947.55385291 hartree
oneelecener: -5183.95809551 hartree
twoeener: 2236.40424259 hartree
kineticenergy: 1066.94062588 hartree
xcener: -102.627130495887 hartree
chargesum: -0.0000000
charge: -0.262374 -0.387722 -0.336555 -0.379332 -0.150353 -0.171996 0.077563 0.041323 -0.070516 -0.252309 -0.254953 -0.183478 0.334350 -0.050877 -0.202530 -0.237617 0.088674 0.233117 0.343278 -0.029934 -0.085887 -0.396934 0.101638 0.089080 0.069971 0.091915 0.094404 0.071479 0.086077 0.088543 0.098914 0.069995 0.083630 0.084645 0.076196 0.084679 0.087569 0.084009 0.125907 0.128597 0.103975 0.110844 0.123196 0.131254 0.248544
qa: -0.2624 -0.3877 -0.3366 -0.3793 -0.1504 -0.1720 0.0776 0.0413 -0.0705 -0.2523 -0.2550 -0.1835 0.3343 -0.0509 -0.2025 -0.2376 0.0887 0.2331 0.3433 -0.0299 -0.0859 -0.3969 0.1016 0.0891 0.0700 0.0919 0.0944 0.0715 0.0861 0.0885 0.0989 0.0700 0.0836 0.0846 0.0762 0.0847 0.0876 0.0840 0.1259 0.1286 0.1040 0.1108 0.1232 0.1313 0.2485
va: 2.1169 2.1148 2.1805 2.1465 3.1347 3.1322 3.7502 3.7860 3.8694 3.9184 3.9112 3.9119 4.2254 3.8320 3.9334 3.9449 3.9024 4.2528 4.3379 3.8896 3.9217 3.7741 3.6407 1.0340 1.0359 1.0044 1.0033 1.0105 1.0006 1.0024 1.0213 1.0221 0.9980 0.9983 1.0122 1.0163 0.9988 0.9992 1.0001 1.0056 1.0106 1.0091 0.9841 1.0093 0.9707
dispcorr: -0.019347331 hartree
energy: -1071.540634345389
dipole: -35.74157 36.33030 0.58873 3.14824 -3.94145 -0.79321 6.93526 -6.07305 0.86221
magnitude: 1.31118 au
magnitude: 3.33275 debye
