program: Orca
programVersion: 5.0.2
elementType: O O O O N N C C C C C C C C C C C C C C C C C H H H H H H H H H H H H H H H H H H H H H H
charge: 0
multiplicity: 1
keywords: wb97x-d3
keywords: def2-TZVPP
keywords: def2/J RIJCOSX
keywords: DEFGRID2
keywords: scfconv7
keywords: smallprint printgap noloewdin
keywords: NOSOSCF
formula: C17H22N2O4
InChI: InChI=1/C17H22N2O4/c1-6-7-18-9-13(20)19(16(18)22)10-23-15(21)14-12(8-11(2)3)17(14,4)5/h1,8,12,14H,7,9-10H2,2-5H3
45 atoms
O  0.479269 0.949018 -0.212058
O  -0.879656 1.945305 -1.677112
O  3.465664 1.890903 1.210568
O  2.42218 -1.193689 -1.980289
N  2.714843 0.59035 -0.534109
N  4.073557 -1.149464 -0.37263
C  -3.049474 1.494737 0.533274
C  -3.129823 0.379111 -0.46002
C  -1.796791 0.715955 0.164223
C  -3.569638 1.257972 1.930925
C  -3.24615 2.914164 0.060107
C  -3.75871 -0.932593 -0.155005
C  -0.730031 1.28312 -0.6845
C  -5.072098 -1.158006 -0.114764
C  -5.621975 -2.521914 0.173373
C  -6.094678 -0.091471 -0.361965
C  1.603424 1.367309 -0.969139
C  3.507062 0.892513 0.549701
C  3.00435 -0.672054 -1.068914
C  4.438231 -0.291656 0.721484
C  4.527862 -2.509494 -0.495098
C  4.150605 -3.327812 0.655607
C  3.848358 -3.978243 1.617031
H  -3.217459 0.706927 -1.493371
H  -1.442176 0.036112 0.931355
H  -3.390126 0.241276 2.27738
H  -3.098356 1.944428 2.636302
H  -4.647286 1.429192 1.970285
H  -2.688898 3.615073 0.68446
H  -2.937884 3.066148 -0.970747
H  -4.302864 3.179427 0.137006
H  -3.085497 -1.766115 0.023774
H  -4.8342 -3.247844 0.370878
H  -6.287715 -2.502339 1.03969
H  -6.215471 -2.89138 -0.666711
H  -6.718403 -0.3465 -1.222512
H  -6.770427 0.004236 0.49159
H  -5.650734 0.884251 -0.549991
H  1.445172 1.202934 -2.034075
H  1.814212 2.421784 -0.790243
H  5.482416 0.029579 0.679089
H  4.267149 -0.761837 1.695572
H  5.614482 -2.529186 -0.616916
H  4.099149 -2.92522 -1.408089
H  3.572692 -4.560522 2.463356
totalener: -1071.51951423 hartree
nucrepener: 1897.00156200 hartree
electener: -2968.52107623 hartree
oneelecener: -5225.97813478 hartree
twoeener: 2257.45705855 hartree
kineticenergy: 1066.93821584 hartree
xcener: -102.625317293526 hartree
chargesum: -0.0000000
charge: -0.264118 -0.388989 -0.338779 -0.378158 -0.152811 -0.172815 0.063795 -0.030336 -0.080224 -0.244384 -0.263665 -0.183734 0.344300 -0.023980 -0.209872 -0.245840 0.089259 0.234511 0.344217 -0.029114 -0.082741 -0.398998 0.101609 0.110101 0.078421 0.083387 0.098032 0.083722 0.090139 0.106230 0.079418 0.090929 0.079368 0.083157 0.087443 0.098669 0.087874 0.084570 0.127262 0.125314 0.104086 0.110224 0.123158 0.130840 0.248522
qa: -0.2641 -0.3890 -0.3388 -0.3782 -0.1528 -0.1728 0.0638 -0.0303 -0.0802 -0.2444 -0.2637 -0.1837 0.3443 -0.0240 -0.2099 -0.2458 0.0893 0.2345 0.3442 -0.0291 -0.0827 -0.3990 0.1016 0.1101 0.0784 0.0834 0.0980 0.0837 0.0901 0.1062 0.0794 0.0909 0.0794 0.0832 0.0874 0.0987 0.0879 0.0846 0.1273 0.1253 0.1041 0.1102 0.1232 0.1308 0.2485
va: 2.1167 2.1100 2.1789 2.1463 3.1344 3.1315 3.7320 3.8243 3.8736 3.9079 3.9048 3.8583 4.2123 3.7348 3.9377 3.9350 3.9002 4.2548 4.3386 3.8922 3.9132 3.7834 3.6411 1.0243 1.0340 1.0071 1.0063 1.0022 1.0028 1.0214 1.0019 1.0125 1.0106 0.9990 0.9983 1.0036 0.9984 1.0101 1.0083 1.0007 1.0085 1.0115 0.9839 1.0105 0.9707
dispcorr: -0.020567682 hartree
energy: -1071.540081913931
dipole: -37.21633 37.61814 0.40180 -1.54918 0.54965 -0.99953 6.83972 -5.97850 0.86122
magnitude: 1.37921 au
magnitude: 3.50567 debye
