program: Orca
programVersion: 5.0.2
elementType: O O O O N N C C C C C C C C C C C C C C C C C H H H H H H H H H H H H H H H H H H H H H H
charge: 0
multiplicity: 1
keywords: wb97x-d3
keywords: def2-TZVPP
keywords: def2/J RIJCOSX
keywords: DEFGRID2
keywords: scfconv7
keywords: smallprint printgap noloewdin
keywords: NOSOSCF
formula: C17H22N2O4
InChI: InChI=1/C17H22N2O4/c1-6-7-18-9-13(20)19(16(18)22)10-23-15(21)14-12(8-11(2)3)17(14,4)5/h1,8,12,14H,7,9-10H2,2-5H3
45 atoms
O  -0.091161 -0.186412 -0.784731
O  -1.399534 1.081471 -2.089802
O  2.297179 2.066338 -0.602539
O  2.648019 -2.44713 -1.12861
N  2.189102 -0.177389 -1.092557
N  4.046552 -0.905025 -0.139416
C  -2.403358 1.866976 0.835982
C  -3.456251 1.174425 0.035176
C  -2.085101 0.552818 0.139764
C  -2.463256 1.799775 2.342814
C  -1.820345 3.157835 0.315415
C  -4.634396 0.530937 0.671386
C  -1.196913 0.533831 -1.039837
C  -5.223552 -0.588876 0.250356
C  -6.436146 -1.137437 0.939626
C  -4.746811 -1.37722 -0.931282
C  0.930718 -0.199485 -1.764401
C  2.741643 0.955315 -0.542732
C  2.938307 -1.326672 -0.808411
C  4.015756 0.50386 0.142638
C  4.999758 -1.809414 0.446636
C  4.958677 -1.792121 1.907161
C  4.925329 -1.747019 3.105133
H  -3.650004 1.629657 -0.933451
H  -1.977599 -0.30065 0.800061
H  -1.46739 1.928512 2.769876
H  -3.097144 2.595224 2.740339
H  -2.858557 0.849814 2.70249
H  -2.386652 4.002938 0.711399
H  -0.78192 3.276243 0.630909
H  -1.847413 3.22536 -0.769912
H  -5.064672 1.046438 1.525477
H  -6.261743 -2.157162 1.291789
H  -6.730773 -0.532019 1.796078
H  -7.286963 -1.186473 0.255484
H  -4.469675 -2.392335 -0.635516
H  -5.544673 -1.478533 -1.671085
H  -3.891189 -0.925576 -1.428321
H  0.870003 -1.114943 -2.352023
H  0.853363 0.664711 -2.422348
H  4.87971 1.036952 -0.263863
H  3.961726 0.714357 1.215374
H  6.009762 -1.556504 0.110213
H  4.783405 -2.811943 0.074916
H  4.891446 -1.720372 4.167793
totalener: -1071.51897785 hartree
nucrepener: 1917.90203960 hartree
electener: -2989.42101745 hartree
oneelecener: -5267.84877285 hartree
twoeener: 2278.42775540 hartree
kineticenergy: 1066.93861658 hartree
xcener: -102.626490960205 hartree
chargesum: -0.0000000
charge: -0.262397 -0.376668 -0.342826 -0.382197 -0.137745 -0.171898 0.124494 -0.016680 -0.116342 -0.276432 -0.251044 -0.239078 0.340276 -0.007063 -0.211279 -0.223883 0.064216 0.233157 0.342247 -0.017548 -0.085151 -0.400257 0.103373 0.106124 0.088809 0.092327 0.090414 0.084371 0.082905 0.095605 0.096486 0.093044 0.084427 0.077720 0.087005 0.086718 0.089072 0.082244 0.121081 0.136642 0.103362 0.109504 0.123754 0.130546 0.248565
qa: -0.2624 -0.3767 -0.3428 -0.3822 -0.1377 -0.1719 0.1245 -0.0167 -0.1163 -0.2764 -0.2510 -0.2391 0.3403 -0.0071 -0.2113 -0.2239 0.0642 0.2332 0.3422 -0.0175 -0.0852 -0.4003 0.1034 0.1061 0.0888 0.0923 0.0904 0.0844 0.0829 0.0956 0.0965 0.0930 0.0844 0.0777 0.0870 0.0867 0.0891 0.0822 0.1211 0.1366 0.1034 0.1095 0.1238 0.1305 0.2486
va: 2.1096 2.1228 2.1680 2.1436 3.1118 3.1416 3.7660 3.8185 3.8307 3.9079 3.9018 3.9015 4.1902 3.7355 3.9421 3.9398 3.8980 4.2474 4.3419 3.8908 3.9104 3.7810 3.6350 1.0265 1.0295 1.0062 1.0015 1.0049 1.0015 1.0052 1.0193 1.0093 0.9992 1.0098 0.9985 1.0007 1.0021 1.0195 1.0088 1.0121 1.0083 1.0117 0.9832 1.0115 0.9707
dispcorr: -0.020803743 hartree
energy: -1071.539781589161
dipole: -29.30324 30.21897 0.91574 3.77817 -4.02934 -0.25117 10.11905 -9.05469 1.06436
magnitude: 1.42636 au
magnitude: 3.62553 debye
