program: Orca
programVersion: 5.0.2
elementType: O O O O N N C C C C C C C C C C C C C C C C C H H H H H H H H H H H H H H H H H H H H H H
charge: 0
multiplicity: 1
keywords: wb97x-d3
keywords: def2-TZVPP
keywords: def2/J RIJCOSX
keywords: DEFGRID2
keywords: scfconv7
keywords: smallprint printgap noloewdin
keywords: NOSOSCF
formula: C17H22N2O4
InChI: InChI=1/C17H22N2O4/c1-6-7-18-9-13(20)19(16(18)22)10-23-15(21)14-12(8-11(2)3)17(14,4)5/h1,8,12,14H,7,9-10H2,2-5H3
45 atoms
O  0.421908 1.544069 1.184848
O  -0.140172 1.507813 -0.981064
O  2.944273 1.51352 -1.818501
O  2.028451 -1.033849 1.848748
N  2.305953 0.530724 0.16727
N  2.679085 -1.599907 -0.289509
C  -3.008367 2.106748 0.143682
C  -2.883988 0.643767 -0.153243
C  -1.833331 1.326788 0.703443
C  -4.026868 2.580787 1.153681
C  -2.814697 3.084109 -0.990277
C  -3.754864 -0.377436 0.456096
C  -0.462046 1.471062 0.176025
C  -4.318858 -1.422995 -0.152993
C  -5.176138 -2.383756 0.616248
C  -4.173147 -1.750478 -1.607958
C  1.792815 1.66736 0.86743
C  2.764823 0.549876 -1.1330
C  2.308496 -0.756477 0.714015
C  3.041652 -0.897201 -1.489403
C  2.967849 -2.990451 -0.068779
C  4.399814 -3.28038 -0.113137
C  5.57657 -3.504316 -0.174137
H  -2.541402 0.434116 -1.160558
H  -1.879795 1.126948 1.768121
H  -5.013066 2.656724 0.692615
H  -4.116857 1.920182 2.014628
H  -3.757095 3.56942 1.528443
H  -3.774939 3.273881 -1.473296
H  -2.438602 4.040093 -0.620542
H  -2.124728 2.725819 -1.74969
H  -3.945775 -0.262997 1.518941
H  -5.258916 -2.110383 1.667429
H  -6.186059 -2.43064 0.200928
H  -4.771857 -3.398002 0.565785
H  -5.149863 -1.759739 -2.098012
H  -3.540369 -1.054737 -2.153868
H  -3.753451 -2.751196 -1.736804
H  1.989138 2.54526 0.250743
H  2.288936 1.772087 1.829355
H  2.437895 -1.193952 -2.35173
H  4.096373 -1.028669 -1.74984
H  2.450308 -3.599018 -0.815989
H  2.55923 -3.267602 0.903893
H  6.619923 -3.706796 -0.211551
totalener: -1071.51769358 hartree
nucrepener: 1945.12203756 hartree
electener: -3016.63973114 hartree
oneelecener: -5322.40175217 hartree
twoeener: 2305.76202103 hartree
kineticenergy: 1066.94319251 hartree
xcener: -102.629066359737 hartree
chargesum: -0.0000000
charge: -0.260643 -0.388280 -0.329826 -0.374867 -0.156507 -0.167323 0.084044 0.042798 -0.104015 -0.245683 -0.255599 -0.180999 0.349478 -0.055439 -0.200759 -0.237783 0.090410 0.250235 0.323700 -0.030267 -0.088948 -0.400126 0.103190 0.087162 0.076864 0.093234 0.072706 0.090774 0.085212 0.083891 0.102856 0.071091 0.076924 0.083410 0.083773 0.086638 0.083116 0.084757 0.128594 0.127421 0.103038 0.110539 0.123645 0.129550 0.248014
qa: -0.2606 -0.3883 -0.3298 -0.3749 -0.1565 -0.1673 0.0840 0.0428 -0.1040 -0.2457 -0.2556 -0.1810 0.3495 -0.0554 -0.2008 -0.2378 0.0904 0.2502 0.3237 -0.0303 -0.0889 -0.4001 0.1032 0.0872 0.0769 0.0932 0.0727 0.0908 0.0852 0.0839 0.1029 0.0711 0.0769 0.0834 0.0838 0.0866 0.0831 0.0848 0.1286 0.1274 0.1030 0.1105 0.1236 0.1295 0.2480
va: 2.1293 2.1095 2.1918 2.1540 3.0915 3.1342 3.7321 3.7893 3.8530 3.9180 3.9132 3.9039 4.2243 3.8283 3.9342 3.9447 3.9132 4.2436 4.3671 3.8924 3.9218 3.7808 3.6321 1.0351 1.0381 1.0034 1.0109 1.0047 1.0005 1.0031 1.0216 1.0226 1.0127 0.9981 0.9985 0.9994 1.0156 0.9988 1.0154 0.9938 1.0086 1.0097 0.9834 1.0108 0.9710
dispcorr: -0.020530065 hartree
energy: -1071.538223644088
dipole: -33.65350 33.32989 -0.32361 -1.76279 0.95628 -0.80651 -2.08298 2.00834 -0.07464
magnitude: 0.87221 au
magnitude: 2.21698 debye
