program: Orca
programVersion: 5.0.2
elementType: O O O O N N C C C C C C C C C C C C C C C C C H H H H H H H H H H H H H H H H H H H H H H
charge: 0
multiplicity: 1
keywords: wb97x-d3
keywords: def2-TZVPP
keywords: def2/J RIJCOSX
keywords: DEFGRID2
keywords: scfconv7
keywords: smallprint printgap noloewdin
keywords: NOSOSCF
formula: C17H22N2O4
InChI: InChI=1/C17H22N2O4/c1-6-7-18-9-13(20)19(16(18)22)10-23-15(21)14-12(8-11(2)3)17(14,4)5/h1,8,12,14H,7,9-10H2,2-5H3
45 atoms
O  0.472339 1.450817 1.188624
O  -0.049091 1.343282 -0.984585
O  3.020745 1.598541 -1.787458
O  2.210777 -1.031645 1.847218
N  2.4294 0.565383 0.187565
N  2.908573 -1.538905 -0.290657
C  -2.96615 1.755425 0.083292
C  -2.732924 0.303826 -0.19599
C  -1.75269 1.053521 0.672405
C  -4.038059 2.137449 1.074926
C  -2.81463 2.749154 -1.041746
C  -3.564983 -0.772035 0.402421
C  -0.386508 1.296956 0.167787
C  -4.759037 -1.148817 -0.056282
C  -5.527964 -2.262755 0.58604
C  -5.419674 -0.509078 -1.238866
C  1.837166 1.662445 0.888332
C  2.888723 0.620296 -1.112095
C  2.488993 -0.726704 0.718789
C  3.236334 -0.807435 -1.483109
C  3.249478 -2.920369 -0.088816
C  4.690342 -3.158262 -0.14957
C  5.873301 -3.342734 -0.223898
H  -2.354973 0.099026 -1.194922
H  -1.807449 0.863185 1.738834
H  -4.114727 1.433261 1.902112
H  -3.839924 3.126818 1.490608
H  -5.01414 2.171866 0.586731
H  -2.514518 3.727771 -0.662327
H  -2.086126 2.441108 -1.787012
H  -3.775318 2.876239 -1.545348
H  -3.151825 -1.29206 1.261958
H  -6.512673 -1.921061 0.914369
H  -5.70134 -3.07957 -0.118876
H  -5.008755 -2.67235 1.451558
H  -4.84249 0.31707 -1.649499
H  -5.575022 -1.238754 -2.037751
H  -6.408538 -0.127872 -0.972188
H  1.984122 2.555046 0.279027
H  2.313976 1.792924 1.8568
H  2.6470 -1.12422 -2.348389
H  4.295949 -0.885038 -1.744908
H  2.747223 -3.539539 -0.837984
H  2.860824 -3.22277 0.88455
H  6.922203 -3.510253 -0.275282
totalener: -1071.51665226 hartree
nucrepener: 1943.94739025 hartree
electener: -3015.46404251 hartree
oneelecener: -5320.10723152 hartree
twoeener: 2304.64318902 hartree
kineticenergy: 1066.94748643 hartree
xcener: -102.628890930651 hartree
chargesum: -0.0000000
charge: -0.261216 -0.389467 -0.329674 -0.376178 -0.157806 -0.165566 0.072966 -0.038610 -0.096022 -0.243770 -0.265584 -0.189763 0.348685 -0.025939 -0.210485 -0.240611 0.091844 0.249869 0.321869 -0.029045 -0.088561 -0.401461 0.104755 0.107666 0.085603 0.084131 0.096211 0.085359 0.088985 0.107276 0.080807 0.095160 0.083820 0.086417 0.080179 0.082693 0.097523 0.087134 0.128363 0.127062 0.103690 0.110682 0.124408 0.128582 0.248017
qa: -0.2612 -0.3895 -0.3297 -0.3762 -0.1578 -0.1656 0.0730 -0.0386 -0.0960 -0.2438 -0.2656 -0.1898 0.3487 -0.0259 -0.2105 -0.2406 0.0918 0.2499 0.3219 -0.0290 -0.0886 -0.4015 0.1048 0.1077 0.0856 0.0841 0.0962 0.0854 0.0890 0.1073 0.0808 0.0952 0.0838 0.0864 0.0802 0.0827 0.0975 0.0871 0.1284 0.1271 0.1037 0.1107 0.1244 0.1286 0.2480
va: 2.1304 2.1064 2.1921 2.1530 3.0918 3.1350 3.7197 3.8307 3.8395 3.9096 3.9051 3.8511 4.2341 3.7351 3.9390 3.9369 3.9135 4.2440 4.3686 3.8914 3.9191 3.7827 3.6296 1.0251 1.0349 1.0070 1.0059 1.0022 1.0035 1.0207 1.0018 1.0123 0.9991 0.9980 1.0105 1.0110 1.0029 0.9996 1.0153 0.9935 1.0085 1.0098 0.9832 1.0115 0.9709
dispcorr: -0.021637396 hartree
energy: -1071.538289658756
dipole: -37.03464 36.61112 -0.42352 -0.44240 -0.32330 -0.76570 -1.84902 1.76631 -0.08271
magnitude: 0.87892 au
magnitude: 2.23404 debye
