program: Orca
programVersion: 5.0.2
elementType: O O O O N N C C C C C C C C C C C C C C C C C H H H H H H H H H H H H H H H H H H H H H H
charge: 0
multiplicity: 1
keywords: wb97x-d3
keywords: def2-TZVPP
keywords: def2/J RIJCOSX
keywords: DEFGRID2
keywords: scfconv7
keywords: smallprint printgap noloewdin
keywords: NOSOSCF
formula: C17H22N2O4
InChI: InChI=1/C17H22N2O4/c1-6-7-18-9-13(20)19(16(18)22)10-23-15(21)14-12(8-11(2)3)17(14,4)5/h1,8,12,14H,7,9-10H2,2-5H3
45 atoms
O  0.012002 -0.848991 0.528137
O  -1.552279 -1.653092 -0.866218
O  1.42008 0.15092 -2.207025
O  3.443335 -1.462235 1.544369
N  2.16455 -0.899731 -0.30253
N  4.082187 0.153262 0.030998
C  -2.614291 1.30014 -0.39651
C  -3.516152 0.269272 0.219254
C  -2.04016 0.232364 0.519896
C  -2.626865 2.706407 0.151722
C  -2.356975 1.243696 -1.882656
C  -4.477718 0.594479 1.293815
C  -1.212818 -0.860002 -0.032878
C  -5.805199 0.48001 1.220448
C  -6.676236 0.824322 2.391118
C  -6.546151 0.015546 0.003255
C  1.008495 -1.690682 -0.01789
C  2.247939 -0.023175 -1.357804
C  3.270098 -0.808213 0.552351
C  3.593566 0.660645 -1.221643
C  5.42772 0.364935 0.495043
C  6.426844 -0.178864 -0.42251
C  7.231773 -0.616377 -1.196553
H  -3.83159 -0.505253 -0.471739
H  -1.721176 0.589143 1.4937
H  -1.690842 3.216902 -0.081287
H  -3.440144 3.280328 -0.295914
H  -2.761858 2.740077 1.232052
H  -3.0808 1.873448 -2.403358
H  -1.358821 1.615162 -2.122346
H  -2.43998 0.238614 -2.28942
H  -4.054959 0.953382 2.227975
H  -7.389128 1.611514 2.132913
H  -7.267622 -0.038653 2.707582
H  -6.097151 1.164304 3.248852
H  -5.898217 -0.209933 -0.840653
H  -7.134313 -0.879008 0.222759
H  -7.255456 0.779585 -0.324723
H  1.286695 -2.444254 0.716792
H  0.657889 -2.172275 -0.929064
H  4.240634 0.392056 -2.063376
H  3.472983 1.746999 -1.219117
H  5.523279 -0.103822 1.474967
H  5.605664 1.434517 0.636144
H  7.948726 -1.014223 -1.873737
totalener: -1071.51948068 hartree
nucrepener: 1900.36416243 hartree
electener: -2971.88364310 hartree
oneelecener: -5232.77393107 hartree
twoeener: 2260.89028796 hartree
kineticenergy: 1066.94268407 hartree
xcener: -102.627279985414 hartree
chargesum: 0.0000000
charge: -0.270559 -0.371154 -0.343703 -0.381830 -0.134769 -0.172709 0.105112 0.024309 -0.114003 -0.236099 -0.250978 -0.195778 0.344550 -0.035685 -0.208684 -0.237543 0.058714 0.234693 0.343594 -0.020209 -0.087399 -0.399266 0.103777 0.092039 0.073410 0.090386 0.090336 0.071225 0.083328 0.090035 0.097247 0.075948 0.082867 0.086074 0.076951 0.084279 0.087895 0.083401 0.121249 0.142053 0.110137 0.102787 0.131670 0.123310 0.248991
qa: -0.2706 -0.3712 -0.3437 -0.3818 -0.1348 -0.1727 0.1051 0.0243 -0.1140 -0.2361 -0.2510 -0.1958 0.3445 -0.0357 -0.2087 -0.2375 0.0587 0.2347 0.3436 -0.0202 -0.0874 -0.3993 0.1038 0.0920 0.0734 0.0904 0.0903 0.0712 0.0833 0.0900 0.0972 0.0759 0.0829 0.0861 0.0770 0.0843 0.0879 0.0834 0.1212 0.1421 0.1101 0.1028 0.1317 0.1233 0.2490
va: 2.1075 2.1367 2.1676 2.1446 3.1082 3.1375 3.7547 3.7793 3.9091 3.9043 3.9105 3.8992 4.2232 3.7924 3.9380 3.9488 3.8906 4.2412 4.3426 3.8894 3.9221 3.7749 3.6395 1.0347 1.0377 1.0047 1.0059 1.0099 1.0006 1.0095 1.0208 1.0186 0.9985 0.9977 1.0119 1.0135 0.9993 0.9999 1.0123 1.0146 1.0091 1.0111 1.0092 0.9842 0.9705
dispcorr: -0.020504194 hartree
energy: -1071.539984868992
dipole: -34.30831 35.08923 0.78091 13.51200 -12.36979 1.14221 2.05260 -2.01896 0.03363
magnitude: 1.38405 au
magnitude: 3.51798 debye
