program: Orca
programVersion: 5.0.2
elementType: Br F F O O O C C C C C C C C C C C C C C C C C C C C C C C C H H H H H H H H H H H H H H H H H H H H H H H
charge: 0
multiplicity: 1
keywords: wb97x-d3
keywords: def2-TZVPP
keywords: def2/J RIJCOSX
keywords: DEFGRID2
keywords: scfconv7
keywords: smallprint printgap noloewdin
keywords: NOSOSCF
formula: C24H23BrF2O3
InChI: InChI=1/C24H23BrF2O3/c1-23(2,19-11-13-21(14-12-19)30-24(25,26)27)17-28-16-18-7-6-10-22(15-18)29-20-8-4-3-5-9-20/h3-15H,16-17H2,1-2H3
53 atoms
Br 1.909768 -1.459596 2.070224
F  3.324113 -1.6991 -0.195551
F  3.458533 -3.422382 1.070495
O  -3.446495 0.148402 0.576111
O  1.673407 -3.186367 -0.092034
O  0.931742 2.777637 0.752469
C  -3.428024 -1.053665 -1.501259
C  -3.584605 0.307782 -0.819371
C  -2.069914 -1.635824 -1.127871
C  -3.506096 -0.827058 -3.015055
C  -4.588906 -1.96098 -1.095889
C  -0.902469 -0.960414 -1.488634
C  -1.929328 -2.822344 -0.414628
C  -3.726187 1.310926 1.314894
C  0.357058 -1.432179 -1.155618
C  -0.678271 -3.311379 -0.063447
C  0.452269 -2.610368 -0.433221
C  -2.683506 2.392232 1.178591
C  -1.342049 2.072532 0.998843
C  -3.056626 3.729687 1.27354
C  -0.402157 3.08754 0.905726
C  -2.10341 4.734234 1.199993
C  -0.7658 4.420457 1.003849
C  2.61117 -2.518718 0.587368
C  1.365363 2.290596 -0.450786
C  2.648181 1.753248 -0.467255
C  0.609159 2.343201 -1.615523
C  3.173414 1.271045 -1.654995
C  1.147939 1.846432 -2.796347
C  2.426203 1.309003 -2.826534
H  -2.838835 1.012507 -1.210204
H  -4.573734 0.721862 -1.060568
H  -2.733497 -0.147053 -3.375475
H  -3.398975 -1.769991 -3.552515
H  -4.472992 -0.398348 -3.285528
H  -5.532299 -1.4960 -1.38711
H  -4.633708 -2.146314 -0.022844
H  -4.533998 -2.928014 -1.598341
H  -0.961504 -0.036144 -2.048757
H  -2.797392 -3.390092 -0.110437
H  -4.709302 1.719814 1.047718
H  -3.787633 1.000169 2.361222
H  1.231992 -0.881177 -1.474567
H  -0.589435 -4.232637 0.49757
H  -1.02248 1.039186 0.924996
H  -4.100834 3.986597 1.405347
H  -2.403768 5.770777 1.277971
H  -0.016751 5.198205 0.928728
H  3.228039 1.717535 0.446092
H  -0.388682 2.761852 -1.621148
H  4.173556 0.858104 -1.661896
H  0.553089 1.88519 -3.699677
H  2.836573 0.923673 -3.75014
elementType: Br F O C H
totalener: -3928.10134224 hartree
nucrepener: 3674.63805638 hartree
electener: -7602.73939861 hartree
twoeener: 5144.16431282 hartree
cpcmener: -0.02690896 hartree
kineticenergy: 3918.76420297 hartree
xcener: -198.379928293403 hartree
chargesum: -0.0000000
charge: -0.075529 -0.153709 -0.152823 -0.387939 -0.271805 -0.342274 0.394780 -0.082870 -0.034788 -0.337850 -0.370340 -0.268822 -0.190857 0.069458 -0.082614 -0.128147 0.087592 0.045095 -0.233739 -0.207943 0.253351 -0.132968 -0.212263 0.428101 0.358462 -0.270211 -0.245337 -0.112897 -0.154068 -0.188112 0.106564 0.115954 0.102942 0.109418 0.104962 0.104954 0.095646 0.109753 0.150678 0.146370 0.099707 0.109108 0.150978 0.149793 0.130372 0.144174 0.161113 0.148697 0.134909 0.154191 0.154494 0.160842 0.155448
qa: -0.0755 -0.1537 -0.1528 -0.3879 -0.2718 -0.3423 0.3948 -0.0829 -0.0348 -0.3379 -0.3703 -0.2688 -0.1909 0.0695 -0.0826 -0.1281 0.0876 0.0451 -0.2337 -0.2079 0.2534 -0.1330 -0.2123 0.4281 0.3585 -0.2702 -0.2453 -0.1129 -0.1541 -0.1881 0.1066 0.1160 0.1029 0.1094 0.1050 0.1050 0.0956 0.1098 0.1507 0.1464 0.0997 0.1091 0.1510 0.1498 0.1304 0.1442 0.1611 0.1487 0.1349 0.1542 0.1545 0.1608 0.1554
va: 1.1728 1.1273 1.1411 1.9120 2.1066 2.0594 3.5634 3.9234 3.6374 3.9272 3.9267 4.0222 3.9689 3.8823 3.9113 3.9998 3.8820 3.5474 3.9878 3.9449 3.7031 3.8835 4.0047 4.5517 3.5947 3.9565 3.8291 3.8325 3.8525 3.8605 0.9852 1.0027 1.0003 1.0027 1.0027 1.0058 1.0120 0.9994 0.9948 0.9967 0.9992 0.9903 1.0118 1.0038 1.0185 1.0011 0.9882 1.0031 1.0163 1.0042 0.9923 0.9915 0.9915
dispcorr: -0.034358935 hartree
energy: -3928.135701169855
dipole: -62.63542 60.33487 -2.30056 29.69191 -28.74067 0.95124 -40.36798 39.22942 -1.13856
magnitude: 2.73747 au
magnitude: 6.95810 debye
