program: Orca
programVersion: 5.0.2
elementType: Br F F O O O C C C C C C C C C C C C C C C C C C C C C C C C H H H H H H H H H H H H H H H H H H H H H H H
charge: 0
multiplicity: 1
keywords: wb97x-d3
keywords: def2-TZVPP
keywords: def2/J RIJCOSX
keywords: DEFGRID2
keywords: scfconv7
keywords: smallprint printgap noloewdin
keywords: NOSOSCF
formula: C24H23BrF2O3
InChI: InChI=1/C24H23BrF2O3/c1-23(2,19-11-13-21(14-12-19)30-24(25,26)27)17-28-16-18-7-6-10-22(15-18)29-20-8-4-3-5-9-20/h3-15H,16-17H2,1-2H3
53 atoms
Br 2.946419 -2.521567 -1.46127
F  2.334119 -3.96697 0.70113
F  3.931611 -2.56263 1.036547
O  -3.630276 0.822717 0.324745
O  1.93144 -1.802905 1.025709
O  0.236037 3.867315 -0.779231
C  -3.662267 -1.554227 -0.081124
C  -4.1948 -0.388487 0.761974
C  -2.161132 -1.67575 0.160459
C  -3.979361 -1.333236 -1.563137
C  -4.420452 -2.803383 0.374145
C  -1.24818 -0.867225 -0.519885
C  -1.65133 -2.545618 1.123776
C  -3.822305 1.901065 1.206333
C  0.111563 -0.911779 -0.249174
C  -0.293416 -2.618798 1.399069
C  0.574803 -1.799213 0.704543
C  -3.023461 3.079501 0.724533
C  -1.741136 2.894586 0.213441
C  -3.551517 4.363064 0.803218
C  -1.001133 3.992399 -0.200619
C  -2.800058 5.453147 0.386728
C  -1.52011 5.277204 -0.114065
C  2.738655 -2.712614 0.475212
C  1.151859 2.955316 -0.32132
C  2.014574 2.417311 -1.268047
C  1.283696 2.625822 1.022395
C  3.022623 1.553997 -0.864135
C  2.288867 1.749616 1.408762
C  3.165649 1.215614 0.474175
H  -5.290789 -0.354087 0.681272
H  -3.953825 -0.567813 1.819481
H  -5.058469 -1.249312 -1.702089
H  -3.53053 -0.434044 -1.980448
H  -3.635352 -2.179456 -2.159175
H  -5.47414 -2.712688 0.107508
H  -4.375584 -2.956907 1.453007
H  -4.03325 -3.700276 -0.110853
H  -1.581846 -0.175347 -1.280037
H  -2.311939 -3.18772 1.688676
H  -4.88292 2.173586 1.280678
H  -3.496707 1.626507 2.219776
H  0.791557 -0.250591 -0.771682
H  0.068412 -3.292532 2.164198
H  -1.322121 1.899032 0.138529
H  -4.553931 4.511039 1.185192
H  -3.215527 6.45022 0.448276
H  -0.932707 6.123697 -0.445545
H  1.902143 2.682629 -2.311635
H  0.621466 3.046882 1.767849
H  3.695581 1.1419 -1.604307
H  2.390281 1.494372 2.455487
H  3.949752 0.538893 0.785456
elementType: Br F O C H
totalener: -3928.09952071 hartree
nucrepener: 3564.99175123 hartree
electener: -7493.09127194 hartree
twoeener: 5034.49075935 hartree
cpcmener: -0.02559683 hartree
kineticenergy: 3918.77856897 hartree
xcener: -198.380691576086 hartree
chargesum: -0.0000000
charge: -0.083109 -0.157046 -0.151594 -0.377622 -0.281075 -0.338971 0.368501 -0.071952 0.016813 -0.354291 -0.346814 -0.274844 -0.217087 0.084195 -0.151524 -0.149486 0.175457 -0.025415 -0.188777 -0.215975 0.277960 -0.120956 -0.256794 0.442058 0.299165 -0.242086 -0.187146 -0.119062 -0.164421 -0.181846 0.105087 0.106489 0.103026 0.096001 0.109759 0.105418 0.100284 0.117401 0.148368 0.149051 0.092551 0.097169 0.155075 0.151833 0.143378 0.142709 0.159860 0.147405 0.144330 0.156501 0.150740 0.159959 0.151354
qa: -0.0831 -0.1570 -0.1516 -0.3776 -0.2811 -0.3390 0.3685 -0.0720 0.0168 -0.3543 -0.3468 -0.2748 -0.2171 0.0842 -0.1515 -0.1495 0.1755 -0.0254 -0.1888 -0.2160 0.2780 -0.1210 -0.2568 0.4421 0.2992 -0.2421 -0.1871 -0.1191 -0.1644 -0.1818 0.1051 0.1065 0.1030 0.0960 0.1098 0.1054 0.1003 0.1174 0.1484 0.1491 0.0926 0.0972 0.1551 0.1518 0.1434 0.1427 0.1599 0.1474 0.1443 0.1565 0.1507 0.1600 0.1514
va: 1.1780 1.1369 1.1422 1.9485 2.0791 2.0704 3.5612 3.9584 3.5979 3.9285 3.9108 4.0910 4.0016 3.8880 3.9534 4.0632 3.7401 3.7697 3.9033 3.9408 3.7054 3.8968 3.9944 4.5567 3.6613 3.9738 3.8636 3.8458 3.8646 3.8275 0.9965 0.9955 1.0029 1.0118 1.0002 1.0053 1.0011 1.0000 1.0041 0.9959 0.9927 0.9899 0.9951 1.0049 1.0018 1.0042 0.9883 1.0071 1.0093 0.9970 0.9957 0.9913 1.0014
dispcorr: -0.032334192 hartree
energy: -3928.131854902076
dipole: -74.97917 72.88806 -2.09112 40.02924 -40.20805 -0.17880 17.34711 -16.32795 1.01916
magnitude: 2.33311 au
magnitude: 5.93031 debye
