program: Orca
programVersion: 5.0.2
elementType: Br F F O O O C C C C C C C C C C C C C C C C C C C C C C C C H H H H H H H H H H H H H H H H H H H H H H H
charge: 0
multiplicity: 1
keywords: wb97x-d3
keywords: def2-TZVPP
keywords: def2/J RIJCOSX
keywords: DEFGRID2
keywords: scfconv7
keywords: smallprint printgap noloewdin
keywords: NOSOSCF
formula: C24H23BrF2O3
InChI: InChI=1/C24H23BrF2O3/c1-23(2,19-11-13-21(14-12-19)30-24(25,26)27)17-28-16-18-7-6-10-22(15-18)29-20-8-4-3-5-9-20/h3-15H,16-17H2,1-2H3
53 atoms
Br 1.248765 -3.410201 -1.471303
F  2.378383 -4.601971 0.656166
F  2.181153 -2.466923 0.845869
O  -3.23539 0.441097 -1.262211
O  0.448829 -3.830654 1.161934
O  0.662199 4.327067 0.387272
C  -4.121687 -0.436811 0.793989
C  -3.69474 0.812763 0.019775
C  -2.917436 -1.363237 0.902714
C  -5.311377 -1.097766 0.098676
C  -4.575413 0.008385 2.188417
C  -2.888097 -2.625437 0.316567
C  -1.775783 -0.942774 1.587759
C  -2.500668 1.453721 -1.916572
C  -1.762844 -3.434366 0.393597
C  -0.642664 -1.734355 1.679503
C  -0.647622 -2.973816 1.06383
C  -1.148981 1.665986 -1.284985
C  -0.794417 2.910417 -0.782811
C  -0.259153 0.601558 -1.161939
C  0.428357 3.087124 -0.147961
C  0.957265 0.787411 -0.525139
C  1.31053 2.025598 -0.004788
C  1.554612 -3.582962 0.452202
C  1.928967 4.85112 0.425563
C  2.82453 4.717721 -0.628756
C  2.262931 5.593353 1.549962
C  4.067246 5.329204 -0.540754
C  3.503954 6.210414 1.617552
C  4.41376 6.07642 0.577622
H  -4.545735 1.50324 -0.063347
H  -2.912492 1.338921 0.580897
H  -5.656663 -1.97289 0.651386
H  -6.143312 -0.393355 0.051935
H  -5.094091 -1.414674 -0.921229
H  -5.431446 0.681302 2.112456
H  -3.79282 0.534881 2.735489
H  -4.881173 -0.850477 2.787078
H  -3.746838 -3.005512 -0.218448
H  -1.750792 0.030783 2.060535
H  -2.385445 1.12584 -2.951797
H  -3.057191 2.398647 -1.935778
H  -1.763162 -4.414771 -0.064574
H  0.217028 -1.381672 2.232912
H  -1.480208 3.745715 -0.866809
H  -0.520191 -0.375191 -1.551103
H  1.641405 -0.043077 -0.411217
H  2.256033 2.147056 0.507738
H  2.563103 4.150316 -1.512953
H  1.55299 5.691992 2.361535
H  4.765432 5.224199 -1.360856
H  3.759942 6.792449 2.493236
H  5.383119 6.552921 0.635808
elementType: Br F O C H
totalener: -3928.10014173 hartree
nucrepener: 3475.21650204 hartree
electener: -7403.31664378 hartree
twoeener: 4944.42365601 hartree
cpcmener: -0.02636148 hartree
kineticenergy: 3918.78489673 hartree
xcener: -198.380275236968 hartree
chargesum: 0.0000000
charge: -0.080890 -0.148514 -0.156437 -0.387750 -0.279522 -0.339672 0.412281 -0.096771 -0.086267 -0.370919 -0.338234 -0.170855 -0.186985 0.075153 -0.146717 -0.202381 0.179066 0.025286 -0.248495 -0.238215 0.296225 -0.125250 -0.206023 0.435623 0.303914 -0.202781 -0.261368 -0.146676 -0.122193 -0.191457 0.110672 0.110137 0.111380 0.104867 0.096867 0.105579 0.102217 0.109162 0.147516 0.142997 0.113977 0.097705 0.150015 0.151462 0.131867 0.124841 0.145567 0.158196 0.158069 0.148045 0.162914 0.161487 0.161286
qa: -0.0809 -0.1485 -0.1564 -0.3877 -0.2795 -0.3397 0.4123 -0.0968 -0.0863 -0.3709 -0.3382 -0.1709 -0.1870 0.0752 -0.1467 -0.2024 0.1791 0.0253 -0.2485 -0.2382 0.2962 -0.1252 -0.2060 0.4356 0.3039 -0.2028 -0.2614 -0.1467 -0.1222 -0.1915 0.1107 0.1101 0.1114 0.1049 0.0969 0.1056 0.1022 0.1092 0.1475 0.1430 0.1140 0.0977 0.1500 0.1515 0.1319 0.1248 0.1456 0.1582 0.1581 0.1480 0.1629 0.1615 0.1613
va: 1.1736 1.1479 1.1269 1.9124 2.0971 2.0610 3.5184 3.9730 3.6330 3.9247 3.9255 3.9519 3.9306 3.8752 4.0155 3.9881 3.7356 3.6369 3.9972 3.9211 3.7027 3.8486 3.9787 4.5417 3.6630 3.9096 4.0090 3.8837 3.8779 3.9007 1.0037 0.9812 0.9988 1.0055 1.0107 1.0029 1.0026 1.0021 0.9970 1.0048 0.9900 0.9984 1.0044 1.0083 1.0196 1.0130 1.0032 0.9960 0.9971 1.0080 0.9890 0.9880 0.9895
dispcorr: -0.030789120 hartree
energy: -3928.130930853990
dipole: -45.03372 44.20179 -0.83193 65.17135 -64.04631 1.12503 19.10288 -18.84781 0.25507
magnitude: 1.42228 au
magnitude: 3.61514 debye
