program: Orca
programVersion: 5.0.2
elementType: Br F F O O O C C C C C C C C C C C C C C C C C C C C C C C C H H H H H H H H H H H H H H H H H H H H H H H
charge: 0
multiplicity: 1
keywords: wb97x-d3
keywords: def2-TZVPP
keywords: def2/J RIJCOSX
keywords: DEFGRID2
keywords: scfconv7
keywords: smallprint printgap noloewdin
keywords: NOSOSCF
formula: C24H23BrF2O3
InChI: InChI=1/C24H23BrF2O3/c1-23(2,19-11-13-21(14-12-19)30-24(25,26)27)17-28-16-18-7-6-10-22(15-18)29-20-8-4-3-5-9-20/h3-15H,16-17H2,1-2H3
53 atoms
Br 1.540938 -3.561227 -0.689607
F  1.396719 -5.569051 1.094558
F  1.479358 -3.622745 1.98874
O  -2.313512 0.725254 -1.730368
O  -0.405214 -4.409652 1.099549
O  1.919185 4.138711 0.613115
C  -3.890335 -0.048861 -0.096019
C  -3.028103 1.119219 -0.579181
C  -2.971243 -1.222767 0.221517
C  -4.936406 -0.387656 -1.157829
C  -4.629369 0.404113 1.168223
C  -3.009102 -2.419507 -0.487991
C  -2.024573 -1.110267 1.24205
C  -1.330109 1.650417 -2.130601
C  -2.137913 -3.461695 -0.200789
C  -1.150835 -2.139889 1.552237
C  -1.213903 -3.310001 0.813919
C  -0.155456 1.697341 -1.185995
C  0.330944 2.919428 -0.742202
C  0.443176 0.517363 -0.748299
C  1.426411 2.960859 0.113141
C  1.518377 0.570741 0.123427
C  2.024196 1.790261 0.553113
C  0.925327 -4.332646 0.998236
C  1.919754 5.266458 -0.171469
C  2.35313 5.241281 -1.491502
C  1.525261 6.455811 0.423461
C  2.378235 6.423382 -2.217158
C  1.566446 7.632923 -0.311419
C  1.986173 7.621812 -1.634124
H  -3.669796 1.983013 -0.803287
H  -2.344777 1.428661 0.221803
H  -5.591032 -1.195903 -0.828331
H  -5.564238 0.486138 -1.339656
H  -4.501751 -0.680727 -2.112996
H  -5.260553 -0.397381 1.553682
H  -5.273749 1.256758 0.946464
H  -3.950462 0.707237 1.965586
H  -3.722081 -2.563675 -1.287536
H  -1.951897 -0.198619 1.82104
H  -0.994366 1.328453 -3.119265
H  -1.754214 2.655859 -2.247535
H  -2.184418 -4.383732 -0.765622
H  -0.450671 -2.016651 2.366651
H  -0.155465 3.834313 -1.060468
H  0.067445 -0.441651 -1.082743
H  1.980492 -0.344513 0.470044
H  2.8700 1.832336 1.227341
H  2.670698 4.314493 -1.952591
H  1.19334 6.460287 1.453907
H  2.712824 6.405002 -3.246062
H  1.260694 8.560451 0.154701
H  2.010973 8.539417 -2.206392
elementType: Br F O C H
totalener: -3928.10048088 hartree
nucrepener: 3439.26399841 hartree
electener: -7367.36447929 hartree
twoeener: 4908.29426222 hartree
cpcmener: -0.02637107 hartree
kineticenergy: 3918.76808200 hartree
xcener: -198.377490089807 hartree
chargesum: -0.0000000
charge: -0.079133 -0.149907 -0.158852 -0.383944 -0.272933 -0.342338 0.408550 -0.095328 -0.070841 -0.370548 -0.337284 -0.171503 -0.208541 0.072697 -0.143945 -0.177802 0.152584 -0.010862 -0.159226 -0.232395 0.265214 -0.088012 -0.260052 0.434688 0.276246 -0.184771 -0.247300 -0.148994 -0.127878 -0.185515 0.110762 0.111066 0.111635 0.104697 0.096531 0.109336 0.104560 0.102867 0.146506 0.144139 0.110926 0.097655 0.151435 0.153501 0.141613 0.119494 0.139983 0.148060 0.158895 0.148620 0.162558 0.161603 0.161481
qa: -0.0791 -0.1499 -0.1589 -0.3839 -0.2729 -0.3423 0.4086 -0.0953 -0.0708 -0.3705 -0.3373 -0.1715 -0.2085 0.0727 -0.1439 -0.1778 0.1526 -0.0109 -0.1592 -0.2324 0.2652 -0.0880 -0.2601 0.4347 0.2762 -0.1848 -0.2473 -0.1490 -0.1279 -0.1855 0.1108 0.1111 0.1116 0.1047 0.0965 0.1093 0.1046 0.1029 0.1465 0.1441 0.1109 0.0977 0.1514 0.1535 0.1416 0.1195 0.1400 0.1481 0.1589 0.1486 0.1626 0.1616 0.1615
va: 1.1754 1.1459 1.1283 1.9155 2.1001 2.0578 3.5309 3.9602 3.6108 3.9250 3.9235 3.9534 3.9617 3.8874 4.0134 3.9815 3.7583 3.6668 3.8656 3.9271 3.7155 3.8570 4.0763 4.5447 3.6879 3.9071 4.0055 3.8863 3.8785 3.8963 1.0035 0.9823 0.9990 1.0054 1.0114 1.0020 1.0034 1.0027 0.9970 1.0058 0.9892 1.0003 1.0034 1.0102 1.0079 1.0097 1.0000 1.0065 0.9960 1.0071 0.9892 0.9879 0.9893
dispcorr: -0.029978229 hartree
energy: -3928.130459106458
dipole: -47.28635 45.97299 -1.31336 77.00303 -75.29590 1.70713 -3.99820 3.52371 -0.47449
magnitude: 2.20553 au
magnitude: 5.60602 debye
