program: Orca
programVersion: 5.0.2
elementType: Br F F O O O C C C C C C C C C C C C C C C C C C C C C C C C H H H H H H H H H H H H H H H H H H H H H H H
charge: 0
multiplicity: 1
keywords: wb97x-d3
keywords: def2-TZVPP
keywords: def2/J RIJCOSX
keywords: DEFGRID2
keywords: scfconv7
keywords: smallprint printgap noloewdin
keywords: NOSOSCF
formula: C24H23BrF2O3
InChI: InChI=1/C24H23BrF2O3/c1-23(2,19-11-13-21(14-12-19)30-24(25,26)27)17-28-16-18-7-6-10-22(15-18)29-20-8-4-3-5-9-20/h3-15H,16-17H2,1-2H3
53 atoms
Br 3.837199 -1.600009 -2.19984
F  1.842706 -3.295749 -1.605136
F  2.735345 -2.379766 0.111849
O  -3.911396 0.593967 0.816783
O  1.406024 -1.157395 -1.193513
O  0.47665 2.797996 -0.323532
C  -3.782097 -1.780899 1.098617
C  -4.584271 -0.60862 0.523814
C  -2.37069 -1.696454 0.53037
C  -4.463575 -3.080252 0.659641
C  -3.807322 -1.721907 2.625853
C  -1.260252 -1.41929 1.321576
C  -2.167659 -1.824053 -0.845496
C  -4.296552 1.69827 0.03697
C  0.007417 -1.264591 0.773739
C  -0.912321 -1.679791 -1.411194
C  0.164529 -1.392563 -0.591638
C  -3.172967 2.696625 -0.009337
C  -1.851743 2.268182 -0.099522
C  -3.448544 4.060543 -0.017183
C  -0.83271 3.204338 -0.187302
C  -2.420038 4.985267 -0.122764
C  -1.100523 4.563626 -0.19872
C  2.317288 -2.135403 -1.137464
C  1.097993 2.149167 0.709098
C  0.588212 2.093279 2.000842
C  2.320197 1.556548 0.408463
C  1.307064 1.426041 2.984882
C  3.024905 0.896611 1.401969
C  2.522822 0.824012 2.695907
H  -4.693124 -0.729635 -0.562111
H  -5.59708 -0.610823 0.949616
H  -5.484507 -3.123189 1.043776
H  -4.518037 -3.177819 -0.424881
H  -3.927316 -3.947614 1.04674
H  -3.245763 -2.548317 3.064436
H  -4.837398 -1.805376 2.975939
H  -3.400867 -0.793687 3.027727
H  -1.361381 -1.302502 2.391443
H  -3.001572 -2.029593 -1.504454
H  -4.530297 1.380945 -0.988428
H  -5.204243 2.171433 0.431589
H  0.841851 -1.016105 1.415979
H  -0.779236 -1.767903 -2.481613
H  -1.608689 1.211787 -0.108937
H  -4.473837 4.401128 0.058713
H  -2.644131 6.043627 -0.131386
H  -0.291171 5.278766 -0.270549
H  -0.354772 2.559031 2.25448
H  2.711411 1.611249 -0.599525
H  0.905182 1.383061 3.98879
H  3.97371 0.435435 1.160444
H  3.07326 0.304328 3.468487
elementType: Br F O C H
totalener: -3928.09901450 hartree
nucrepener: 3599.04439532 hartree
electener: -7527.14340982 hartree
twoeener: 5069.15888943 hartree
cpcmener: -0.02708613 hartree
kineticenergy: 3918.79790631 hartree
xcener: -198.382100346615 hartree
chargesum: -0.0000000
charge: -0.041370 -0.159658 -0.163773 -0.384042 -0.298116 -0.341154 0.403408 -0.080312 -0.083475 -0.332624 -0.372469 -0.190777 -0.172543 0.075724 -0.193774 -0.207569 0.243071 -0.023949 -0.112692 -0.178282 0.190809 -0.150538 -0.186295 0.425112 0.340412 -0.213918 -0.255912 -0.170244 -0.116070 -0.182538 0.108095 0.105880 0.104527 0.101967 0.107937 0.111341 0.104767 0.096343 0.144787 0.142387 0.094610 0.094661 0.164807 0.150796 0.100132 0.142973 0.160139 0.148034 0.150307 0.135175 0.159441 0.148064 0.156385
qa: -0.0414 -0.1597 -0.1638 -0.3840 -0.2981 -0.3412 0.4034 -0.0803 -0.0835 -0.3326 -0.3725 -0.1908 -0.1725 0.0757 -0.1938 -0.2076 0.2431 -0.0239 -0.1127 -0.1783 0.1908 -0.1505 -0.1863 0.4251 0.3404 -0.2139 -0.2559 -0.1702 -0.1161 -0.1825 0.1081 0.1059 0.1045 0.1020 0.1079 0.1113 0.1048 0.0963 0.1448 0.1424 0.0946 0.0947 0.1648 0.1508 0.1001 0.1430 0.1601 0.1480 0.1503 0.1352 0.1594 0.1481 0.1564
va: 1.1885 1.1349 1.1297 1.9248 2.0814 2.0554 3.5446 3.9484 3.6951 3.9233 3.9262 3.9334 3.9555 3.8979 4.0047 4.1053 3.6278 3.7197 3.8706 3.9126 3.7756 3.9083 3.9736 4.5467 3.6219 3.8358 3.9143 3.8887 3.8270 3.8767 0.9935 0.9998 1.0029 1.0029 1.0023 0.9988 1.0057 1.0104 1.0015 1.0032 0.9909 0.9954 0.9991 1.0020 1.0210 1.0045 0.9888 1.0033 1.0035 1.0183 0.9908 0.9957 0.9911
dispcorr: -0.033922880 hartree
energy: -3928.132937384492
dipole: -85.05694 82.65578 -2.40115 24.49149 -24.53052 -0.03903 41.56878 -41.25135 0.31743
magnitude: 2.42236 au
magnitude: 6.15715 debye
