program: Orca
programVersion: 5.0.2
elementType: Br F F O O O C C C C C C C C C C C C C C C C C C C C C C C C H H H H H H H H H H H H H H H H H H H H H H H
charge: 0
multiplicity: 1
keywords: wb97x-d3
keywords: def2-TZVPP
keywords: def2/J RIJCOSX
keywords: DEFGRID2
keywords: scfconv7
keywords: smallprint printgap noloewdin
keywords: NOSOSCF
formula: C24H23BrF2O3
InChI: InChI=1/C24H23BrF2O3/c1-23(2,19-11-13-21(14-12-19)30-24(25,26)27)17-28-16-18-7-6-10-22(15-18)29-20-8-4-3-5-9-20/h3-15H,16-17H2,1-2H3
53 atoms
Br 2.291154 -3.883889 -1.438744
F  3.423239 -2.217434 0.3292
F  3.954371 -1.788733 -1.70534
O  -3.633278 1.157194 0.526042
O  2.029988 -1.147948 -1.042156
O  0.535827 3.921683 -0.039736
C  -3.338971 -1.196322 0.896222
C  -4.184971 -0.106892 0.239057
C  -1.898759 -1.170461 0.394432
C  -3.960184 -2.544745 0.515595
C  -3.404567 -1.025225 2.418365
C  -1.543815 -0.609306 -0.832517
C  -0.880518 -1.768408 1.134948
C  -4.054688 2.193975 -0.327689
C  -0.23588 -0.629089 -1.288926
C  0.436506 -1.801291 0.698525
C  0.746605 -1.227205 -0.522017
C  -3.086378 3.337697 -0.212989
C  -1.719894 3.076913 -0.175659
C  -3.53487 4.652371 -0.166222
C  -0.820616 4.125124 -0.059469
C  -2.622424 5.695738 -0.084782
C  -1.261517 5.440745 -0.016461
C  2.937766 -2.114345 -0.915906
C  1.081412 2.860978 0.637794
C  2.273299 2.355954 0.134914
C  0.533426 2.344277 1.806852
C  2.923914 1.333046 0.809494
C  1.187246 1.309075 2.459841
C  2.381794 0.798754 1.96984
H  -4.246909 -0.265823 -0.845622
H  -5.212454 -0.181213 0.620218
H  -3.408035 -3.36821 0.970242
H  -4.994744 -2.607674 0.860257
H  -3.955106 -2.695961 -0.565292
H  -2.872694 -0.136177 2.758189
H  -2.984438 -1.882597 2.94385
H  -4.444856 -0.937413 2.736898
H  -2.282803 -0.142863 -1.469537
H  -1.097187 -2.225052 2.091155
H  -4.083767 1.842546 -1.368377
H  -5.069255 2.531414 -0.081541
H  0.015334 -0.18189 -2.241994
H  1.182519 -2.257754 1.332787
H  -1.359637 2.057642 -0.23592
H  -4.597019 4.862067 -0.189552
H  -2.974015 6.718413 -0.050665
H  -0.548884 6.251111 0.068579
H  2.692503 2.769372 -0.773716
H  -0.387126 2.738831 2.216694
H  3.854355 0.946526 0.414469
H  0.755062 0.904305 3.36564
H  2.883515 -0.007208 2.488348
elementType: Br F O C H
totalener: -3928.09866115 hartree
nucrepener: 3585.58712859 hartree
electener: -7513.68578974 hartree
twoeener: 5055.24078380 hartree
cpcmener: -0.02899972 hartree
kineticenergy: 3918.78350927 hartree
xcener: -198.383595916089 hartree
chargesum: -0.0000000
charge: -0.073974 -0.161668 -0.152021 -0.384125 -0.268100 -0.337002 0.365912 -0.062601 -0.069711 -0.330738 -0.366095 -0.180192 -0.192398 0.069341 -0.170084 -0.150341 0.165295 0.000007 -0.169969 -0.224588 0.271400 -0.115694 -0.255579 0.434277 0.307780 -0.241383 -0.193040 -0.135350 -0.179601 -0.163698 0.107622 0.107467 0.103667 0.104385 0.103469 0.104211 0.101517 0.101610 0.151129 0.146847 0.098242 0.098504 0.147010 0.153851 0.113830 0.142645 0.159979 0.146685 0.145275 0.156405 0.152628 0.160472 0.156492
qa: -0.0740 -0.1617 -0.1520 -0.3841 -0.2681 -0.3370 0.3659 -0.0626 -0.0697 -0.3307 -0.3661 -0.1802 -0.1924 0.0693 -0.1701 -0.1503 0.1653 0.0000 -0.1700 -0.2246 0.2714 -0.1157 -0.2556 0.4343 0.3078 -0.2414 -0.1930 -0.1353 -0.1796 -0.1637 0.1076 0.1075 0.1037 0.1044 0.1035 0.1042 0.1015 0.1016 0.1511 0.1468 0.0982 0.0985 0.1470 0.1539 0.1138 0.1426 0.1600 0.1467 0.1453 0.1564 0.1526 0.1605 0.1565
va: 1.1834 1.1271 1.1435 1.9287 2.0743 2.0757 3.5306 3.9198 3.6465 3.9183 3.9285 3.9048 3.9758 3.8854 3.9863 3.9269 3.6663 3.7041 3.8566 3.9537 3.7346 3.8910 3.9994 4.5626 3.6672 3.9645 3.8439 3.8331 3.8511 3.7983 0.9921 1.0031 1.0028 1.0036 1.0039 1.0099 1.0031 1.0040 0.9926 0.9995 0.9901 0.9972 1.0067 1.0127 1.0363 1.0056 0.9881 1.0072 1.0086 0.9969 0.9979 0.9915 0.9940
dispcorr: -0.033908500 hartree
energy: -3928.132569645424
dipole: -68.54679 66.22466 -2.32213 53.75092 -54.20548 -0.45456 29.19219 -29.04603 0.14616
magnitude: 2.37071 au
magnitude: 6.02587 debye
