program: Orca
programVersion: 5.0.2
elementType: Br F F O O O C C C C C C C C C C C C C C C C C C C C C C C C H H H H H H H H H H H H H H H H H H H H H H H
charge: 0
multiplicity: 1
keywords: wb97x-d3
keywords: def2-TZVPP
keywords: def2/J RIJCOSX
keywords: DEFGRID2
keywords: scfconv7
keywords: smallprint printgap noloewdin
keywords: NOSOSCF
formula: C24H23BrF2O3
InChI: InChI=1/C24H23BrF2O3/c1-23(2,19-11-13-21(14-12-19)30-24(25,26)27)17-28-16-18-7-6-10-22(15-18)29-20-8-4-3-5-9-20/h3-15H,16-17H2,1-2H3
53 atoms
Br 2.224866 -3.120595 -2.420705
F  4.046283 -1.724826 -1.023496
F  2.59701 -0.49097 -2.013199
O  -3.583292 0.769147 0.73518
O  2.118807 -1.566582 -0.123521
O  0.736766 3.386809 0.393293
C  -3.50859 -1.628036 0.818407
C  -4.196742 -0.39427 0.233045
C  -2.007166 -1.579023 0.557083
C  -4.090968 -2.854937 0.107116
C  -3.832694 -1.720924 2.311143
C  -1.081499 -2.037112 1.491703
C  -1.504517 -1.110823 -0.656495
C  -3.953426 1.948971 0.064281
C  0.279268 -2.038874 1.227035
C  -0.145991 -1.075945 -0.934467
C  0.740656 -1.556698 0.015995
C  -2.91177 3.007679 0.29571
C  -1.561036 2.673368 0.280174
C  -3.285934 4.335611 0.474699
C  -0.607115 3.663822 0.459654
C  -2.320456 5.319301 0.63256
C  -0.973679 4.989319 0.639196
C  2.751471 -1.609577 -1.292777
C  1.293468 2.387905 1.145298
C  0.711611 1.876036 2.299028
C  2.537773 1.933315 0.721586
C  1.389823 0.90436 3.023676
C  3.207801 0.975839 1.466071
C  2.636426 0.450748 2.617796
H  -4.147914 -0.407255 -0.863827
H  -5.263036 -0.424153 0.495654
H  -5.172355 -2.909829 0.250496
H  -3.89617 -2.826749 -0.966252
H  -3.656106 -3.773893 0.502133
H  -3.500115 -2.665472 2.742283
H  -4.913124 -1.669424 2.454671
H  -3.380407 -0.913575 2.888361
H  -1.406072 -2.41237 2.45196
H  -2.173897 -0.745176 -1.424208
H  -4.038808 1.762419 -1.015081
H  -4.935307 2.30763 0.397446
H  0.978592 -2.409646 1.965125
H  0.17417 -0.666734 -1.881379
H  -1.251169 1.647002 0.121908
H  -4.335671 4.601648 0.490119
H  -2.617651 6.35061 0.769631
H  -0.215447 5.7498 0.775114
H  -0.251686 2.225501 2.646078
H  2.982017 2.342295 -0.17719
H  0.932889 0.505193 3.919758
H  4.178792 0.631418 1.134744
H  3.15678 -0.303852 3.192022
elementType: Br F O C H
totalener: -3928.09897855 hartree
nucrepener: 3598.29837148 hartree
electener: -7526.39735004 hartree
twoeener: 5068.26467780 hartree
cpcmener: -0.02886442 hartree
kineticenergy: 3918.78352482 hartree
xcener: -198.382899153714 hartree
chargesum: 0.0000000
charge: -0.077417 -0.151747 -0.162887 -0.387455 -0.261842 -0.335705 0.364489 -0.049330 -0.063554 -0.328966 -0.378946 -0.142728 -0.274809 0.089108 -0.216110 -0.070898 0.164451 -0.006747 -0.165827 -0.211197 0.250409 -0.127189 -0.236840 0.437529 0.313412 -0.192077 -0.247006 -0.168574 -0.131447 -0.192900 0.108593 0.105773 0.105163 0.102358 0.105200 0.099829 0.102457 0.110418 0.146375 0.143976 0.094590 0.094911 0.153553 0.149894 0.119966 0.142394 0.160303 0.146944 0.154697 0.143753 0.160797 0.153073 0.157786
qa: -0.0774 -0.1517 -0.1629 -0.3875 -0.2618 -0.3357 0.3645 -0.0493 -0.0636 -0.3290 -0.3789 -0.1427 -0.2748 0.0891 -0.2161 -0.0709 0.1645 -0.0067 -0.1658 -0.2112 0.2504 -0.1272 -0.2368 0.4375 0.3134 -0.1921 -0.2470 -0.1686 -0.1314 -0.1929 0.1086 0.1058 0.1052 0.1024 0.1052 0.0998 0.1025 0.1104 0.1464 0.1440 0.0946 0.0949 0.1536 0.1499 0.1200 0.1424 0.1603 0.1469 0.1547 0.1438 0.1608 0.1531 0.1578
va: 1.1798 1.1444 1.1275 1.9319 2.1115 2.0722 3.5357 3.9068 3.6662 3.9206 3.9327 3.9062 4.0575 3.8783 3.9996 3.8801 3.7242 3.7221 3.8761 3.9443 3.7368 3.8942 3.9960 4.5547 3.6526 3.8348 3.9404 3.8485 3.8321 3.8265 0.9933 0.9995 1.0029 1.0030 1.0036 1.0009 1.0057 1.0083 0.9979 1.0033 0.9908 0.9959 1.0039 1.0151 1.0290 1.0053 0.9883 1.0059 0.9987 1.0106 0.9907 0.9967 0.9905
dispcorr: -0.033139417 hartree
energy: -3928.132117970512
dipole: -67.01633 64.61346 -2.40287 37.60128 -37.99081 -0.38953 44.83623 -44.69041 0.14582
magnitude: 2.43860 au
magnitude: 6.19842 debye
