program: Orca
programVersion: 5.0.2
elementType: Br F F O O O C C C C C C C C C C C C C C C C C C C C C C C C H H H H H H H H H H H H H H H H H H H H H H H
charge: 0
multiplicity: 1
keywords: wb97x-d3
keywords: def2-TZVPP
keywords: def2/J RIJCOSX
keywords: DEFGRID2
keywords: scfconv7
keywords: smallprint printgap noloewdin
keywords: NOSOSCF
formula: C24H23BrF2O3
InChI: InChI=1/C24H23BrF2O3/c1-23(2,19-11-13-21(14-12-19)30-24(25,26)27)17-28-16-18-7-6-10-22(15-18)29-20-8-4-3-5-9-20/h3-15H,16-17H2,1-2H3
53 atoms
Br 1.651375 -4.237723 0.237359
F  2.272485 -3.382336 2.704875
F  2.5262 -1.886974 1.189658
O  -3.781571 1.531674 -0.128306
O  0.512139 -2.402843 1.986087
O  1.856518 2.48555 -0.322802
C  -3.606735 -0.479981 -1.462479
C  -3.515266 1.049473 -1.42963
C  -2.511712 -1.045324 -0.566811
C  -3.390478 -0.926144 -2.91295
C  -5.00498 -0.924561 -1.036427
C  -1.171168 -0.831514 -0.891718
C  -2.777911 -1.736975 0.610554
C  -3.047841 2.685606 0.233992
C  -0.133878 -1.269424 -0.085884
C  -1.754818 -2.201951 1.426437
C  -0.440951 -1.962579 1.074093
C  -1.665456 2.332806 0.718403
C  -0.542768 2.645943 -0.03743
C  -1.515104 1.633487 1.915026
C  0.719678 2.274116 0.413853
C  -0.253856 1.268575 2.354168
C  0.872873 1.590364 1.609251
C  1.711931 -2.858725 1.621901
C  2.02176 3.628558 -1.060678
C  1.617363 4.878544 -0.607855
C  2.687811 3.494962 -2.271266
C  1.883434 5.996958 -1.385545
C  2.957216 4.62341 -3.031729
C  2.552598 5.877796 -2.596437
H  -2.521876 1.361099 -1.772887
H  -4.241537 1.471394 -2.137934
H  -2.430023 -0.60032 -3.3128
H  -3.435036 -2.012978 -2.994068
H  -4.169192 -0.513293 -3.557136
H  -5.263078 -0.625561 -0.020686
H  -5.109627 -2.009109 -1.099742
H  -5.748159 -0.485489 -1.70467
H  -0.907417 -0.288225 -1.78989
H  -3.796004 -1.930436 0.918476
H  -2.992819 3.400592 -0.595169
H  -3.608749 3.167791 1.03765
H  0.880468 -1.039235 -0.376325
H  -1.985433 -2.737307 2.338405
H  -0.661881 3.172558 -0.977028
H  -2.386337 1.381888 2.507036
H  -0.138382 0.731602 3.286556
H  1.86041 1.304157 1.948087
H  1.106612 4.98894 0.34028
H  2.998692 2.51468 -2.60945
H  1.569676 6.970803 -1.033174
H  3.480864 4.51621 -3.97262
H  2.760007 6.755556 -3.193463
elementType: Br F O C H
totalener: -3928.09879281 hartree
nucrepener: 3537.79491295 hartree
electener: -7465.89370576 hartree
twoeener: 5007.28006139 hartree
cpcmener: -0.02815927 hartree
kineticenergy: 3918.77849037 hartree
xcener: -198.381846742707 hartree
chargesum: -0.0000000
charge: -0.076435 -0.148614 -0.157723 -0.399947 -0.266850 -0.342741 0.406879 -0.080478 -0.066647 -0.339353 -0.367499 -0.249795 -0.183044 0.071103 -0.145737 -0.171766 0.185825 0.071639 -0.220627 -0.304913 0.328236 -0.060956 -0.298241 0.423890 0.308777 -0.207862 -0.267327 -0.145214 -0.119583 -0.193781 0.106011 0.110476 0.103682 0.107654 0.104763 0.094069 0.111615 0.105776 0.143733 0.143725 0.102760 0.109275 0.153045 0.149233 0.145787 0.142394 0.156347 0.139817 0.157586 0.146369 0.162070 0.161286 0.161312
qa: -0.0764 -0.1486 -0.1577 -0.3999 -0.2669 -0.3427 0.4069 -0.0805 -0.0666 -0.3394 -0.3675 -0.2498 -0.1830 0.0711 -0.1457 -0.1718 0.1858 0.0716 -0.2206 -0.3049 0.3282 -0.0610 -0.2982 0.4239 0.3088 -0.2079 -0.2673 -0.1452 -0.1196 -0.1938 0.1060 0.1105 0.1037 0.1077 0.1048 0.0941 0.1116 0.1058 0.1437 0.1437 0.1028 0.1093 0.1530 0.1492 0.1458 0.1424 0.1563 0.1398 0.1576 0.1464 0.1621 0.1613 0.1613
va: 1.1795 1.1455 1.1281 1.9069 2.0866 2.0517 3.5327 3.9542 3.6060 3.9195 3.9204 4.0798 3.9566 3.8920 3.8981 4.0249 3.6782 3.5118 3.8721 3.9480 3.6042 3.7747 3.9726 4.5767 3.6655 3.9087 4.0143 3.8832 3.8767 3.9021 0.9866 1.0051 1.0016 1.0024 1.0039 1.0129 0.9994 1.0047 1.0046 0.9974 0.9955 0.9916 1.0090 1.0040 1.0073 1.0078 0.9891 1.0147 0.9987 1.0091 0.9893 0.9881 0.9896
dispcorr: -0.032371778 hartree
energy: -3928.131164585859
dipole: -52.25134 51.12600 -1.12534 72.49386 -71.20557 1.28829 -23.61316 22.39474 -1.21842
magnitude: 2.10015 au
magnitude: 5.33815 debye
