program: Orca
programVersion: 5.0.2
elementType: Br F F O O O C C C C C C C C C C C C C C C C C C C C C C C C H H H H H H H H H H H H H H H H H H H H H H H
charge: 0
multiplicity: 1
keywords: wb97x-d3
keywords: def2-TZVPP
keywords: def2/J RIJCOSX
keywords: DEFGRID2
keywords: scfconv7
keywords: smallprint printgap noloewdin
keywords: NOSOSCF
formula: C24H23BrF2O3
InChI: InChI=1/C24H23BrF2O3/c1-23(2,19-11-13-21(14-12-19)30-24(25,26)27)17-28-16-18-7-6-10-22(15-18)29-20-8-4-3-5-9-20/h3-15H,16-17H2,1-2H3
53 atoms
Br 2.43411 -3.331448 -1.015984
F  3.846202 -1.160367 -0.320374
F  2.509854 -0.816387 -1.965449
O  -4.312572 0.752386 -0.50473
O  1.77663 -0.890061 0.131898
O  0.419931 2.433057 -0.421188
C  -3.894949 -1.45832 0.365765
C  -4.482816 -0.06958 0.630446
C  -2.380937 -1.328743 0.245957
C  -4.53178 -2.069214 -0.882751
C  -4.264799 -2.345699 1.560322
C  -1.610583 -1.046439 1.376675
C  -1.70905 -1.434829 -0.966158
C  -4.407104 2.129696 -0.228825
C  -0.2357 -0.919103 1.308102
C  -0.32919 -1.285217 -1.066068
C  0.401405 -1.048611 0.084175
C  -3.119239 2.713145 0.296244
C  -1.901526 2.283224 -0.219882
C  -3.132003 3.715729 1.259416
C  -0.718044 2.866429 0.205402
C  -1.941575 4.297944 1.673895
C  -0.725553 3.887704 1.148319
C  2.617797 -1.398207 -0.764548
C  1.619757 2.322111 0.225302
C  1.74109 2.049579 1.58226
C  2.748232 2.415547 -0.579955
C  3.007089 1.875446 2.125169
C  4.004595 2.231094 -0.024166
C  4.142151 1.962803 1.331434
H  -5.551813 -0.164249 0.866876
H  -3.997012 0.369093 1.511682
H  -4.152074 -3.076682 -1.061177
H  -5.611596 -2.145487 -0.74425
H  -4.362065 -1.487784 -1.787993
H  -5.346578 -2.480664 1.607552
H  -3.950339 -1.923084 2.515024
H  -3.811172 -3.333021 1.46581
H  -2.080067 -0.927556 2.344368
H  -2.251107 -1.633409 -1.879919
H  -4.661726 2.620078 -1.17233
H  -5.226469 2.344783 0.467809
H  0.341022 -0.724596 2.202975
H  0.123595 -1.354017 -2.044311
H  -1.862372 1.504215 -0.971538
H  -4.072449 4.046497 1.682798
H  -1.956522 5.084977 2.416511
H  0.191859 4.36308 1.469764
H  0.869568 1.955727 2.216353
H  2.638518 2.624212 -1.63673
H  3.099801 1.660602 3.181758
H  4.879465 2.300809 -0.657183
H  5.123347 1.821493 1.764288
elementType: Br F O C H
totalener: -3928.09919312 hartree
nucrepener: 3650.08875446 hartree
electener: -7578.18794758 hartree
twoeener: 5120.45219407 hartree
cpcmener: -0.02804095 hartree
kineticenergy: 3918.78720373 hartree
xcener: -198.386089251494 hartree
chargesum: -0.0000000
charge: -0.075953 -0.151234 -0.165488 -0.389681 -0.261222 -0.335108 0.405518 -0.098654 -0.036850 -0.364508 -0.338799 -0.191131 -0.264378 0.079686 -0.236402 -0.110720 0.226252 0.051857 -0.327177 -0.212808 0.312228 -0.133687 -0.235931 0.442055 0.408957 -0.275190 -0.305068 -0.124932 -0.113558 -0.210907 0.108409 0.111393 0.115413 0.105830 0.092032 0.102819 0.103814 0.109795 0.144723 0.144736 0.106084 0.102168 0.150071 0.148262 0.145302 0.143282 0.161220 0.158947 0.156226 0.142656 0.161037 0.158913 0.159700
qa: -0.0760 -0.1512 -0.1655 -0.3897 -0.2612 -0.3351 0.4055 -0.0987 -0.0368 -0.3645 -0.3388 -0.1911 -0.2644 0.0797 -0.2364 -0.1107 0.2263 0.0519 -0.3272 -0.2128 0.3122 -0.1337 -0.2359 0.4421 0.4090 -0.2752 -0.3051 -0.1249 -0.1136 -0.2109 0.1084 0.1114 0.1154 0.1058 0.0920 0.1028 0.1038 0.1098 0.1447 0.1447 0.1061 0.1022 0.1501 0.1483 0.1453 0.1433 0.1612 0.1589 0.1562 0.1427 0.1610 0.1589 0.1597
va: 1.1807 1.1449 1.1227 1.9207 2.1248 2.0396 3.5384 3.9755 3.5980 3.9213 3.9166 3.9792 4.0564 3.8794 4.0026 3.9673 3.6669 3.6038 4.0311 3.9562 3.7012 3.8925 3.9329 4.5443 3.4355 3.8802 3.9873 3.8897 3.8351 3.9077 1.0022 0.9825 0.9991 1.0039 1.0131 1.0049 1.0021 1.0014 1.0020 1.0004 0.9901 0.9966 1.0012 1.0173 1.0174 1.0022 0.9893 0.9960 0.9988 1.0116 0.9887 0.9881 0.9897
dispcorr: -0.034535399 hartree
energy: -3928.133728520258
dipole: -67.79306 66.08725 -1.70581 43.77912 -43.44040 0.33873 24.33912 -22.93509 1.40403
magnitude: 2.23513 au
magnitude: 5.68125 debye
