program: Orca
programVersion: 5.0.2
elementType: Br F F O O O C C C C C C C C C C C C C C C C C C C C C C C C H H H H H H H H H H H H H H H H H H H H H H H
charge: 0
multiplicity: 1
keywords: wb97x-d3
keywords: def2-TZVPP
keywords: def2/J RIJCOSX
keywords: DEFGRID2
keywords: scfconv7
keywords: smallprint printgap noloewdin
keywords: NOSOSCF
formula: C24H23BrF2O3
InChI: InChI=1/C24H23BrF2O3/c1-23(2,19-11-13-21(14-12-19)30-24(25,26)27)17-28-16-18-7-6-10-22(15-18)29-20-8-4-3-5-9-20/h3-15H,16-17H2,1-2H3
53 atoms
Br 3.058937 -2.811251 -0.78226
F  3.418746 -2.989542 1.870761
F  2.900753 -1.017035 1.209156
O  -3.499083 0.85921 -0.042451
O  1.366111 -2.61376 1.415219
O  0.645477 3.483666 0.989588
C  -3.516658 -1.243984 -1.205002
C  -4.247348 -0.316242 -0.225668
C  -2.178124 -1.628998 -0.584317
C  -3.337475 -0.549167 -2.558236
C  -4.418968 -2.461376 -1.421591
C  -1.044558 -0.834589 -0.744729
C  -2.052868 -2.750784 0.235211
C  -3.927555 1.668659 1.023602
C  0.157151 -1.112892 -0.106609
C  -0.858027 -3.065049 0.862187
C  0.239448 -2.239329 0.693535
C  -2.958836 2.807173 1.182227
C  -1.595157 2.593668 1.004622
C  -3.413262 4.077091 1.521892
C  -0.709672 3.653655 1.133261
C  -2.513444 5.121401 1.680594
C  -1.156958 4.922154 1.472334
C  2.615267 -2.315722 1.055833
C  1.152727 2.750656 -0.052316
C  0.521233 2.646621 -1.28643
C  2.386492 2.148327 0.160899
C  1.131417 1.920915 -2.300451
C  2.989916 1.439341 -0.867292
C  2.362784 1.312754 -2.099359
H  -5.24625 -0.082101 -0.621245
H  -4.392569 -0.837311 0.731379
H  -2.83408 -1.208137 -3.267574
H  -4.313965 -0.298361 -2.97643
H  -2.765043 0.375444 -2.505273
H  -3.925872 -3.213829 -2.038405
H  -5.331682 -2.158694 -1.936813
H  -4.722251 -2.937237 -0.488355
H  -1.071631 0.044594 -1.372757
H  -2.894683 -3.408392 0.401532
H  -4.937703 2.060687 0.848773
H  -3.974174 1.084523 1.953545
H  0.984645 -0.432354 -0.25063
H  -0.784622 -3.9465 1.4860
H  -1.221301 1.605928 0.764892
H  -4.473532 4.252233 1.655773
H  -2.872173 6.10715 1.945593
H  -0.453727 5.73896 1.572145
H  -0.432471 3.12397 -1.469811
H  2.872409 2.241707 1.123918
H  0.634333 1.837936 -3.258141
H  3.95186 0.974336 -0.697991
H  2.82925 0.747279 -2.894606
elementType: Br F O C H
totalener: -3928.09851272 hartree
nucrepener: 3589.67913371 hartree
electener: -7517.77764643 hartree
twoeener: 5059.10240244 hartree
cpcmener: -0.02486402 hartree
kineticenergy: 3918.76396019 hartree
xcener: -198.380488822834 hartree
chargesum: 0.0000000
charge: -0.078113 -0.149864 -0.150373 -0.373723 -0.257052 -0.340548 0.350521 -0.081411 0.020952 -0.353655 -0.343802 -0.323067 -0.206164 0.078663 -0.016421 -0.178212 0.159566 -0.013525 -0.199668 -0.216933 0.266534 -0.122659 -0.251148 0.422935 0.305928 -0.208182 -0.233637 -0.155426 -0.122388 -0.172600 0.106348 0.106678 0.111848 0.104150 0.092323 0.116625 0.105707 0.100240 0.157008 0.149337 0.093338 0.098283 0.078660 0.149193 0.162046 0.142478 0.159979 0.147546 0.155981 0.144997 0.160601 0.147620 0.152487
qa: -0.0781 -0.1499 -0.1504 -0.3737 -0.2571 -0.3405 0.3505 -0.0814 0.0210 -0.3537 -0.3438 -0.3231 -0.2062 0.0787 -0.0164 -0.1782 0.1596 -0.0135 -0.1997 -0.2169 0.2665 -0.1227 -0.2511 0.4229 0.3059 -0.2082 -0.2336 -0.1554 -0.1224 -0.1726 0.1063 0.1067 0.1118 0.1042 0.0923 0.1166 0.1057 0.1002 0.1570 0.1493 0.0933 0.0983 0.0787 0.1492 0.1620 0.1425 0.1600 0.1475 0.1560 0.1450 0.1606 0.1476 0.1525
va: 1.1742 1.1438 1.1285 1.9467 2.1285 2.0710 3.5805 3.9674 3.6328 3.9223 3.9067 4.1119 4.0079 3.8926 3.8381 4.0109 3.8359 3.7442 3.9041 3.9463 3.7216 3.8911 4.0043 4.5710 3.6702 3.8400 3.9364 3.8615 3.8354 3.8326 0.9966 0.9947 1.0006 1.0034 1.0124 1.0002 1.0044 1.0023 0.9873 0.9945 0.9923 0.9901 1.0462 1.0049 0.9943 1.0040 0.9883 1.0064 0.9983 1.0095 0.9909 0.9994 0.9933
dispcorr: -0.032778758 hartree
energy: -3928.131291481568
dipole: -76.89760 74.47401 -2.42360 41.63770 -41.83989 -0.20219 -6.26793 5.78023 -0.48770
magnitude: 2.48043 au
magnitude: 6.30476 debye
