program: Gaussian 09
title: 000074771
version: EM64L-G09RevD.01
frameworkgroup: C1[X(C8H12N2O3)]
method: RPBEPBE
basis: SDD
operation: Freq
keyword: #p
keyword: freq=noraman
keyword: PBEPBE/SDD
title: #p freq=noraman PBEPBE/SDD
converged: YES YES NO NO
title: Mulliken charges:
elementType: O O O N N C C C C C C C C H H H H H H H H H H H H
charge: -0.207481 -0.207489 -0.216939 -0.372210 -0.372191 -0.289985 -0.412567 -0.348502 -0.349583 0.161261 0.161345 -0.694686 0.179896 0.291968 0.241866 0.242019 0.206127 0.206185 0.200236 0.200103 0.368044 0.368030 0.211831 0.211815 0.220905
chargesum: 0.00000
title: Mulliken charges with hydrogens summed into heavy atoms:
elementType: O O O N N C C C C C C C C
charge: -0.207481 -0.207489 -0.216939 -0.004166 -0.004161 0.001983 0.071318 0.063810 0.050756 0.161261 0.161345 -0.050135 0.179896
polarizability: 1.10684064e+02 -7.15012258e-02 1.06484944e+02 1.91366539e+01 -1.73868958e-02 1.02585499e+02
1716.lowfreq: -9.4073 -0.0008 -0.0007 -0.0005 4.3191 6.2814 23.5692 48.2892 65.8791
frequency: 22.1595 48.2871 65.8513 104.7705 118.6926 135.6820 158.2575 207.8501 223.1332 262.1076 355.5553 355.6986 384.2515 423.3684 465.5297 474.8815 578.7765 596.3350 643.2937 688.1398 730.4634 742.5547 753.1139 780.3664 789.7592 833.9190 881.4208 906.0084 961.3770 971.2545 993.3432 1057.6186 1083.7047 1101.2580 1121.6417 1183.8519 1206.7009 1240.8996 1268.3559 1279.4837 1296.5788 1308.5091 1311.6612 1339.8837 1360.4459 1364.1440 1376.9228 1376.9882 1389.3618 1453.4033 1467.0011 1475.8927 1476.9792 1486.8914 1628.7626 1657.9345 1677.4532 2959.3864 2972.9146 2975.0824 3002.5283 3005.2981 3017.2381 3030.2055 3070.7140 3076.0946 3076.8661 3519.5417 3521.4112
redmass: 8.0799 4.1970 1.5954 4.5939 2.4943 6.0397 9.3467 3.9043 1.1295 2.2909 6.5935 11.5133 3.9805 4.7468 5.8209 9.6496 3.9736 10.8225 2.8049 2.8530 1.0886 4.8210 1.4800 1.3084 1.7268 3.7734 1.7504 1.9062 1.4676 4.0711 3.1392 3.1352 3.1970 1.9346 1.5818 1.4364 1.9707 2.1637 1.3466 1.2869 1.1617 1.2481 3.1531 1.4917 1.5611 8.6060 1.4755 2.2390 1.2149 1.0855 1.0749 1.0637 1.0424 1.0825 6.8853 8.7730 5.5180 1.0584 1.0590 1.0365 1.0996 1.0639 1.0769 1.1037 1.1016 1.0993 1.1042 1.0757 1.0782
irintensity: 1.1902 0.0007 0.0037 4.2089 0.0656 0.0009 9.1530 0.5726 0.1326 1.3412 15.3129 27.1001 1.6565 5.0033 27.7574 15.4878 6.0690 0.1040 0.9840 24.8486 8.5855 13.2984 0.0337 0.5124 230.2437 8.7967 0.4514 9.4619 0.7610 0.9373 2.6079 3.6543 2.9968 2.9978 1.9056 46.5896 17.1287 64.5293 0.0028 3.6516 18.8795 20.2314 264.5300 33.8534 4.2930 220.0789 11.6014 7.8930 9.0051 18.1478 0.2480 4.6990 13.3725 15.9818 347.4386 102.5606 573.9846 7.9557 51.1880 29.3410 1.0276 23.0967 5.5573 22.0772 35.6792 48.0871 48.5713 88.0266 40.3519
temp: 298.150 k
press: 1.00000 atm
elementType: 8 8 8 7 7 6 6 6 6 6 6 6 6 1 1 1 1 1 1 1 1 1 1 1 1
symmnumber: 1
zpe: 525614.1 jmol-1
zpe.correction: 0.200196 hartree
zpe.thermalcorrener: 0.213290 hartree
zpe.thermalcorrenthalpy: 0.214234 hartree
zpe.thermalcorrgfe: 0.158949 hartree
zpe.sumelectzpe: -646.284235 hartree
zpe.sumelectthermal: -646.271141 hartree
zpe.sumelectthermalent: -646.270197 hartree
zpe.sumelectthermalfe: -646.325481 hartree
dipole: -1.1340 0.0009 0.0486
dipole: 1.1350
quadrupole: -77.5712 -87.1382 -83.0188
quadrupole: -0.0006 -4.8446 -0.0053
quadrupole: 5.0049 -4.5621 -0.4427 -0.0006 -4.8446 -0.0053
hfenergy: -646.4844309 hartree
pointgroup: C01 [X(C8H12N2O3)]
dipole: 0.445447 -0.0022053 0.0312411 debye
dipolederiv: -0.500367 -0.0715721 0.1438902 -0.1321555 -0.9348087 0.3273477 0.1684139 0.1887522 -0.564301 -0.4964273 0.0740938 0.1334482 0.1355036 -0.9743563 -0.3002127 0.1556284 -0.1615606 -0.5287419 -0.7804427 0.0173681 0.4277058 0.0198045 -0.586206 -0.0144139 0.4952106 -0.0148372 -0.8828312 -0.7480214 -0.3926915 0.4390371 -0.1940072 -0.765038 0.2732983 0.4953241 0.5141068 -0.8604029 -0.7371389 0.4230623 0.4043788 0.2286829 -0.8339014 -0.2824354 0.4715361 -0.5238871 -0.8022526 -0.3356433 0.0027609 0.0886899 0.0049322 -0.2797694 0.0076327 0.1260434 0.006909 -0.0493471 0.3516887 -0.0041851 -0.0521722 -0.0011659 0.0474443 0.0021841 0.0393442 0.0021304 0.1037238 -0.0965989 0.0000836 -0.038427 -0.0000084 0.1557067 -0.0053236 -0.028432 -0.0053599 0.0049055 0.116672 -0.0006133 -0.0213721 -0.0028106 0.1718386 -0.0031372 -0.0835066 -0.0028867 0.0687306 0.7829261 0.1971183 -0.5641244 -0.0961472 1.0217848 -0.2410749 -0.6485203 -0.3734289 0.9475605 0.7783645 -0.2319287 -0.544211 0.0547544 1.0698756 0.2424851 -0.6479912 0.3760198 0.9042034 -0.0203878 -0.0016728 -0.0650115 -0.0008629 0.0919961 -0.0033578 -0.0331824 -0.003434 -0.0119024 1.0218897 -0.0204004 -0.6913695 -0.0247566 1.7493579 -0.015041 -0.8168944 -0.0143827 1.2020878 0.0942024 -0.002179 -0.0469497 -0.0025644 0.0404262 -0.0009889 -0.0569158 -0.0008456 0.0045945 0.0108468 -0.0575319 0.0315714 -0.068723 -0.0098217 0.0991227 -0.0046747 0.0550263 0.0150099 0.0129585 0.0590855 0.0254947 0.0677912 -0.023021 -0.0967332 -0.0106264 -0.0521602 0.0261864 0.0134891 0.0697808 0.0382118 0.0824744 -0.0750623 -0.0891912 0.0477542 -0.0725031 -0.0057272 0.0127193 -0.0674559 0.0436118 -0.0790549 -0.06211 0.0930419 0.0537488 0.0760221 -0.0174851 0.0163443 -0.0381008 0.0122883 -0.075778 -0.0698787 0.1231557 0.043168 0.1099277 -0.0372081 0.0171858 0.0383189 0.0090938 0.0779144 -0.0858508 -0.1201504 0.0375222 -0.1071033 -0.0221432 0.2793901 -0.0234114 0.0823679 -0.0324308 0.2105358 0.0346292 0.103991 0.0284669 0.2242027 0.2804409 0.0279351 0.0798972 0.0388044 0.2049034 -0.0345511 0.1008681 -0.0289543 0.2287432 0.0730099 -0.0866223 0.0602747 -0.0555468 -0.0762103 0.1220739 0.0125247 0.0838264 -0.0119379 0.0737174 0.0895398 0.0539873 0.0555154 -0.0900362 -0.1172288 0.0085652 -0.0787415 0.0012128 -0.2208182 -0.0007819 -0.0503115 -0.0001651 0.1022014 -0.0011313 -0.028899 -0.0011024 0.0631194 unknown
polarizability: 111.7107549|-0.7032352|106.489765|-18.8766895|-0.0198919|101.5539869 unknown
InChI: InChI=1S/C8H12N2O3/c1-2-3-4-5-6(11)9-8(13)10-7(5)12/h5,9-10H,2-4H2,1H3
charge 0 multiplicity 1
25 atoms
O  -0.399746 2.392343 -1.283602
O  -0.440492 -2.468054 -1.105987
O  -2.877947 0.096445 1.915049
N  -1.604173 1.211846 0.302313
N  -1.621246 -1.154986 0.391131
C  -0.165609 -0.044407 -1.315603
C  1.399972 -0.053522 -1.219612
C  1.945715 -0.003832 0.223929
C  3.491315 -0.007745 0.254626
C  -0.718182 1.280797 -0.790205
C  -0.739456 -1.318301 -0.694818
C  4.060235 0.03768 1.688795
C  -2.087388 0.054157 0.94121
H  -0.411551 -0.082023 -2.395028
H  1.766703 0.81751 -1.793197
H  1.752588 -0.970743 -1.726047
H  1.57796 0.90748 0.738844
H  1.571993 -0.873976 0.80198
H  3.867797 0.860656 -0.322904
H  3.862353 -0.914318 -0.264795
H  -1.958573 2.10024 0.672267
H  -1.988697 -2.007952 0.826062
H  3.723663 -0.835982 2.278076
H  3.727848 0.949487 2.219754
H  5.165319 0.034899 1.682863
