program: Orca
programVersion: 5.0.2
elementType: Br F F O O O C C C C C C C C C C C C C C C C C C C C C C C C H H H H H H H H H H H H H H H H H H H H H H H
charge: 0
multiplicity: 1
keywords: wb97x-d3
keywords: def2-TZVPP
keywords: def2/J RIJCOSX
keywords: DEFGRID2
keywords: scfconv7
keywords: smallprint printgap noloewdin
keywords: NOSOSCF
formula: C24H23BrF2O3
InChI: InChI=1/C24H23BrF2O3/c1-23(2,19-11-13-21(14-12-19)30-24(25,26)27)17-28-16-18-7-6-10-22(15-18)29-20-8-4-3-5-9-20/h3-15H,16-17H2,1-2H3
53 atoms
Br 2.575323 -2.788699 1.122885
F  2.446307 -0.772257 -0.65034
F  2.946614 -2.662037 -1.533902
O  -4.409043 0.6478 -0.687163
O  0.897392 -2.326763 -1.042181
O  0.365815 3.782851 -0.557265
C  -3.981915 -0.592317 1.339419
C  -4.239574 0.78038 0.708864
C  -2.667569 -1.12039 0.780924
C  -5.16147 -1.521972 1.054538
C  -3.887944 -0.399053 2.856493
C  -1.466998 -0.497837 1.120852
C  -2.601464 -2.169842 -0.131388
C  -3.975542 1.760996 -1.441446
C  -0.253902 -0.876483 0.57048
C  -1.397051 -2.570971 -0.692346
C  -0.231963 -1.909999 -0.35098
C  -2.478643 1.77882 -1.608531
C  -1.706664 2.756914 -0.994797
C  -1.850855 0.779831 -2.349532
C  -0.324959 2.749337 -1.140552
C  -0.472133 0.778646 -2.485727
C  0.303333 1.763423 -1.887698
C  2.146048 -2.077937 -0.65099
C  1.592565 3.538743 0.009884
C  2.603767 4.459366 -0.222562
C  1.807718 2.441642 0.833842
C  3.843192 4.273852 0.375755
C  3.056202 2.256457 1.408638
C  4.079126 3.168894 1.18248
H  -5.139533 1.225578 1.154211
H  -3.403435 1.448679 0.947096
H  -6.071931 -1.097737 1.480594
H  -5.344264 -1.678925 -0.008143
H  -5.01155 -2.501494 1.511251
H  -3.651616 -1.340833 3.353376
H  -4.840437 -0.04459 3.254132
H  -3.127381 0.327871 3.143331
H  -1.45816 0.329188 1.819418
H  -3.496285 -2.698234 -0.429665
H  -4.45436 1.672966 -2.4186
H  -4.318814 2.701419 -0.996861
H  0.631389 -0.333585 0.860854
H  -1.372254 -3.382988 -1.408151
H  -2.179381 3.535217 -0.407019
H  -2.4411 0.007291 -2.826989
H  0.012909 0.007159 -3.068936
H  1.378526 1.757525 -2.013102
H  2.421504 5.315045 -0.860615
H  1.005743 1.744682 1.037545
H  4.630313 4.995173 0.198248
H  3.223401 1.396857 2.04472
H  5.050137 3.022461 1.63636
elementType: Br F O C H
totalener: -3928.09861528 hartree
nucrepener: 3630.13411059 hartree
electener: -7558.23272587 hartree
twoeener: 5099.08259854 hartree
cpcmener: -0.02819812 hartree
kineticenergy: 3918.78254458 hartree
xcener: -198.383711506007 hartree
chargesum: 0.0000000
charge: -0.081613 -0.154045 -0.148430 -0.396292 -0.259270 -0.346232 0.402121 -0.090890 -0.042044 -0.361822 -0.341067 -0.299696 -0.183117 0.069242 -0.140181 -0.205385 0.245637 0.070952 -0.260470 -0.293905 0.294375 -0.091163 -0.219755 0.430447 0.255070 -0.216337 -0.169225 -0.146495 -0.195964 -0.160511 0.109558 0.108322 0.104918 0.093196 0.113535 0.108640 0.104124 0.102793 0.147867 0.144844 0.109121 0.102222 0.148324 0.146327 0.134200 0.143698 0.157084 0.150401 0.147631 0.181294 0.160857 0.155886 0.161224
qa: -0.0816 -0.1540 -0.1484 -0.3963 -0.2593 -0.3462 0.4021 -0.0909 -0.0420 -0.3618 -0.3411 -0.2997 -0.1831 0.0692 -0.1402 -0.2054 0.2456 0.0710 -0.2605 -0.2939 0.2944 -0.0912 -0.2198 0.4304 0.2551 -0.2163 -0.1692 -0.1465 -0.1960 -0.1605 0.1096 0.1083 0.1049 0.0932 0.1135 0.1086 0.1041 0.1028 0.1479 0.1448 0.1091 0.1022 0.1483 0.1463 0.1342 0.1437 0.1571 0.1504 0.1476 0.1813 0.1609 0.1559 0.1612
va: 1.1737 1.1286 1.1467 1.9102 2.1108 2.0579 3.5413 3.9761 3.5950 3.9149 3.9188 4.1266 3.9715 3.8855 3.8851 4.0435 3.6231 3.5310 4.0009 3.9473 3.6742 3.7935 3.8819 4.5581 3.6974 3.9779 3.8335 3.8929 3.9278 3.8726 1.0040 0.9851 1.0047 1.0133 0.9990 1.0019 1.0039 1.0017 1.0034 0.9965 0.9909 0.9953 1.0068 1.0060 1.0182 1.0084 0.9943 1.0055 1.0065 0.9766 0.9880 0.9948 0.9885
dispcorr: -0.034576629 hartree
energy: -3928.133191906551
dipole: -64.83399 64.01585 -0.81814 44.56725 -44.17746 0.38979 -0.90831 1.68657 0.77826
magnitude: 1.19456 au
magnitude: 3.03633 debye
