program: Orca
programVersion: 5.0.2
elementType: Br F F O O O C C C C C C C C C C C C C C C C C C C C C C C C H H H H H H H H H H H H H H H H H H H H H H H
charge: 0
multiplicity: 1
keywords: wb97x-d3
keywords: def2-TZVPP
keywords: def2/J RIJCOSX
keywords: DEFGRID2
keywords: scfconv7
keywords: smallprint printgap noloewdin
keywords: NOSOSCF
formula: C24H23BrF2O3
InChI: InChI=1/C24H23BrF2O3/c1-23(2,19-11-13-21(14-12-19)30-24(25,26)27)17-28-16-18-7-6-10-22(15-18)29-20-8-4-3-5-9-20/h3-15H,16-17H2,1-2H3
53 atoms
Br 2.568742 -2.959657 0.690499
F  2.408377 -0.778219 -0.87293
F  2.882417 -2.575879 -1.94903
O  -4.413577 0.650522 -0.56285
O  0.8476 -2.282524 -1.38056
O  0.299943 3.811423 -0.029375
C  -3.962413 -0.819856 1.300583
C  -4.234963 0.615569 0.838158
C  -2.662427 -1.275792 0.652596
C  -5.146244 -1.716752 0.940046
C  -3.831084 -0.800002 2.827182
C  -1.454132 -0.685793 1.02154
C  -2.621872 -2.224629 -0.3650
C  -4.002271 1.857405 -1.173626
C  -0.256207 -0.998278 0.399462
C  -1.433996 -2.56076 -0.997037
C  -0.260651 -1.935398 -0.620614
C  -2.506402 1.920442 -1.342289
C  -1.747112 2.816393 -0.601791
C  -1.865111 1.040479 -2.212601
C  -0.36499 2.849971 -0.74572
C  -0.486752 1.077066 -2.344031
C  0.276867 1.982382 -1.617195
C  2.105429 -2.077894 -0.995849
C  1.568895 3.571104 0.436733
C  1.899508 2.386817 1.083475
C  2.501498 4.588417 0.29892
C  3.183378 2.222727 1.582311
C  3.777775 4.418034 0.817949
C  4.126656 3.234387 1.453445
H  -5.133995 0.997842 1.340823
H  -3.40026 1.255527 1.148531
H  -5.354087 -1.750972 -0.12904
H  -4.981851 -2.741388 1.278398
H  -6.047136 -1.34911 1.434462
H  -3.588454 -1.792515 3.208837
H  -4.772547 -0.489628 3.283803
H  -3.060441 -0.111338 3.174382
H  -1.427744 0.065668 1.800185
H  -3.523956 -2.722298 -0.691632
H  -4.486375 1.885988 -2.152153
H  -4.357642 2.728952 -0.611381
H  0.635203 -0.480322 0.716949
H  -1.427388 -3.294926 -1.792317
H  -2.230731 3.501785 0.08465
H  -2.443159 0.330669 -2.791593
H  0.00943 0.397159 -3.024469
H  1.351607 2.007853 -1.742813
H  1.161772 1.605995 1.213086
H  2.228816 5.507714 -0.203554
H  3.441282 1.300172 2.085891
H  4.503201 5.214215 0.714409
H  5.124358 3.102633 1.850043
elementType: Br F O C H
totalener: -3928.09882012 hartree
nucrepener: 3614.25752749 hartree
electener: -7542.35634761 hartree
twoeener: 5083.20716720 hartree
cpcmener: -0.02827321 hartree
kineticenergy: 3918.78466793 hartree
xcener: -198.383586606049 hartree
chargesum: -0.0000000
charge: -0.081947 -0.155813 -0.148064 -0.396212 -0.259450 -0.342879 0.401763 -0.091314 -0.045564 -0.361257 -0.341791 -0.302368 -0.180530 0.068290 -0.137640 -0.205698 0.240654 0.067865 -0.266962 -0.288345 0.306060 -0.095960 -0.225752 0.431216 0.263269 -0.176807 -0.221801 -0.188869 -0.144765 -0.163393 0.110037 0.108778 0.093444 0.113394 0.105293 0.108573 0.104932 0.102755 0.147783 0.144626 0.109412 0.102460 0.153519 0.146316 0.134710 0.142336 0.156880 0.150568 0.181802 0.148004 0.156321 0.160776 0.161345
qa: -0.0819 -0.1558 -0.1481 -0.3962 -0.2595 -0.3429 0.4018 -0.0913 -0.0456 -0.3613 -0.3418 -0.3024 -0.1805 0.0683 -0.1376 -0.2057 0.2407 0.0679 -0.2670 -0.2883 0.3061 -0.0960 -0.2258 0.4312 0.2633 -0.1768 -0.2218 -0.1889 -0.1448 -0.1634 0.1100 0.1088 0.0934 0.1134 0.1053 0.1086 0.1049 0.1028 0.1478 0.1446 0.1094 0.1025 0.1535 0.1463 0.1347 0.1423 0.1569 0.1506 0.1818 0.1480 0.1563 0.1608 0.1613
va: 1.1739 1.1285 1.1473 1.9099 2.1119 2.0628 3.5393 3.9744 3.6004 3.9153 3.9197 4.1236 3.9751 3.8875 3.8806 4.0490 3.6412 3.5374 3.9943 3.9455 3.6726 3.7981 3.8816 4.5581 3.6962 3.8555 3.9846 3.9299 3.8901 3.8797 1.0042 0.9846 1.0127 0.9991 1.0048 1.0019 1.0037 1.0018 1.0032 0.9968 0.9909 0.9951 1.0044 1.0061 1.0183 1.0086 0.9942 1.0047 0.9778 1.0066 0.9942 0.9884 0.9886
dispcorr: -0.034040337 hartree
energy: -3928.132860455239
dipole: -64.38769 63.63712 -0.75058 45.20342 -44.84831 0.35511 6.00467 -5.16689 0.83778
magnitude: 1.17955 au
magnitude: 2.99819 debye
