program: Orca
programVersion: 5.0.2
elementType: Br F F O O O C C C C C C C C C C C C C C C C C C C C C C C C H H H H H H H H H H H H H H H H H H H H H H H
charge: 0
multiplicity: 1
keywords: wb97x-d3
keywords: def2-TZVPP
keywords: def2/J RIJCOSX
keywords: DEFGRID2
keywords: scfconv7
keywords: smallprint printgap noloewdin
keywords: NOSOSCF
formula: C24H23BrF2O3
InChI: InChI=1/C24H23BrF2O3/c1-23(2,19-11-13-21(14-12-19)30-24(25,26)27)17-28-16-18-7-6-10-22(15-18)29-20-8-4-3-5-9-20/h3-15H,16-17H2,1-2H3
53 atoms
Br 1.530222 -0.581268 2.138353
F  3.658166 -1.887079 1.149353
F  2.097919 -3.180576 1.858379
O  -3.313713 0.542194 -0.49188
O  1.952787 -2.160626 -0.11501
O  1.255075 2.453347 0.496989
C  -3.441801 -1.446409 -1.819938
C  -4.080977 -0.622072 -0.696666
C  -1.993916 -1.707812 -1.423079
C  -3.563956 -0.69077 -3.143419
C  -4.21683 -2.761657 -1.945745
C  -1.713909 -2.462188 -0.282447
C  -0.913209 -1.161357 -2.108377
C  -3.507474 1.17202 0.748256
C  -0.422372 -2.646855 0.182743
C  0.38873 -1.323523 -1.654593
C  0.622856 -2.046944 -0.501651
C  -2.363967 2.109978 1.02602
C  -1.076954 1.826134 0.577837
C  -2.588055 3.2529 1.787999
C  -0.038826 2.70029 0.87574
C  -1.53728 4.099996 2.104153
C  -0.257139 3.836895 1.640325
C  2.340184 -2.060463 1.161942
C  1.571524 2.053648 -0.770392
C  0.80533 2.372368 -1.88614
C  2.766859 1.357515 -0.914538
C  1.246786 1.987332 -3.145315
C  3.200096 0.991567 -2.179548
C  2.442154 1.299731 -3.302329
H  -5.116343 -0.369637 -0.964979
H  -4.125028 -1.218757 0.224223
H  -3.125744 -1.256836 -3.96723
H  -4.6187 -0.536438 -3.378458
H  -3.088566 0.290186 -3.123927
H  -4.20385 -3.345326 -1.024971
H  -3.796965 -3.381302 -2.739264
H  -5.261597 -2.566464 -2.195677
H  -2.518839 -2.917199 0.280551
H  -1.064013 -0.575084 -3.004518
H  -4.455205 1.72556 0.774578
H  -3.561998 0.42457 1.552474
H  -0.264885 -3.250299 1.065521
H  1.212311 -0.875206 -2.195199
H  -0.87894 0.929687 0.002876
H  -3.588535 3.480044 2.135271
H  -1.716645 4.984159 2.701453
H  0.563925 4.503731 1.869985
H  -0.12091 2.923782 -1.790677
H  3.362159 1.119327 -0.042591
H  0.647918 2.240083 -4.010748
H  4.134101 0.455179 -2.284137
H  2.7802 1.009172 -4.287955
elementType: Br F O C H
totalener: -3928.09880034 hartree
nucrepener: 3755.11798962 hartree
electener: -7683.21678996 hartree
twoeener: 5225.16022463 hartree
cpcmener: -0.02561863 hartree
kineticenergy: 3918.75237393 hartree
xcener: -198.383311705964 hartree
chargesum: 0.0000000
charge: -0.074693 -0.155186 -0.160211 -0.380326 -0.266214 -0.322508 0.400087 -0.082496 -0.079006 -0.370361 -0.334146 -0.202451 -0.185253 0.072703 -0.153750 -0.173765 0.155428 0.003846 -0.148148 -0.208975 0.260809 -0.131210 -0.251913 0.440678 0.367447 -0.223984 -0.295462 -0.166705 -0.110317 -0.184050 0.107334 0.107192 0.111361 0.105089 0.095270 0.102352 0.107583 0.104546 0.141725 0.145489 0.096022 0.095067 0.154546 0.174629 0.097080 0.140523 0.159185 0.146900 0.152990 0.141318 0.160877 0.156379 0.156676
qa: -0.0747 -0.1552 -0.1602 -0.3803 -0.2662 -0.3225 0.4001 -0.0825 -0.0790 -0.3704 -0.3341 -0.2025 -0.1853 0.0727 -0.1537 -0.1738 0.1554 0.0038 -0.1481 -0.2090 0.2608 -0.1312 -0.2519 0.4407 0.3674 -0.2240 -0.2955 -0.1667 -0.1103 -0.1840 0.1073 0.1072 0.1114 0.1051 0.0953 0.1024 0.1076 0.1045 0.1417 0.1455 0.0960 0.0951 0.1545 0.1746 0.0971 0.1405 0.1592 0.1469 0.1530 0.1413 0.1609 0.1564 0.1567
va: 1.1815 1.1381 1.1284 1.9292 2.1063 2.0619 3.5534 3.9439 3.7119 3.9256 3.9224 4.0247 3.9308 3.8998 3.9705 3.8941 3.8354 3.7181 3.8731 3.9327 3.6653 3.9043 4.0198 4.5399 3.5776 3.8715 3.9317 3.8558 3.8678 3.8675 1.0009 0.9934 0.9991 1.0059 1.0106 1.0025 1.0024 1.0027 1.0057 0.9996 0.9926 0.9903 1.0107 0.9996 1.0272 1.0051 0.9885 1.0069 1.0001 1.0158 0.9907 0.9909 0.9909
dispcorr: -0.035496779 hartree
energy: -3928.134297118952
dipole: -55.83225 53.45713 -2.37512 13.74804 -13.93111 -0.18306 -45.83281 45.34927 -0.48354
magnitude: 2.43074 au
magnitude: 6.17846 debye
