program: Orca
programVersion: 5.0.2
elementType: Br F F O O O C C C C C C C C C C C C C C C C C C C C C C C C H H H H H H H H H H H H H H H H H H H H H H H
charge: 0
multiplicity: 1
keywords: wb97x-d3
keywords: def2-TZVPP
keywords: def2/J RIJCOSX
keywords: DEFGRID2
keywords: scfconv7
keywords: smallprint printgap noloewdin
keywords: NOSOSCF
formula: C24H23BrF2O3
InChI: InChI=1/C24H23BrF2O3/c1-23(2,19-11-13-21(14-12-19)30-24(25,26)27)17-28-16-18-7-6-10-22(15-18)29-20-8-4-3-5-9-20/h3-15H,16-17H2,1-2H3
53 atoms
Br 2.539155 -3.778364 -0.305574
F  2.939924 -1.667858 1.31349
F  4.013124 -1.545943 -0.54011
O  -3.578028 0.704238 1.354974
O  1.928331 -1.083634 -0.578565
O  0.220655 3.098784 -1.12454
C  -3.744922 -1.242927 -0.026103
C  -4.181577 0.209792 0.182518
C  -2.225364 -1.262411 -0.146729
C  -4.398972 -1.753609 -1.314025
C  -4.253383 -2.102764 1.132156
C  -1.598475 -0.712806 -1.267231
C  -1.402925 -1.755248 0.859137
C  -3.779267 2.073726 1.577096
C  -0.220904 -0.67953 -1.387648
C  -0.015953 -1.719073 0.770059
C  0.566241 -1.189666 -0.366954
C  -2.992783 2.964586 0.646517
C  -1.722235 2.590492 0.21779
C  -3.52376 4.183027 0.237734
C  -0.99568 3.44391 -0.600843
C  -2.786964 5.029328 -0.577711
C  -1.51735 4.667503 -0.998396
C  2.839529 -1.864181 -0.007139
C  1.268369 2.67928 -0.361106
C  2.369823 2.214458 -1.074044
C  1.306633 2.735986 1.026899
C  3.502313 1.7953 -0.397262
C  2.446623 2.298097 1.690703
C  3.545392 1.823203 0.990988
H  -3.899812 0.809813 -0.693137
H  -5.277503 0.258775 0.264292
H  -4.09578 -2.780996 -1.521299
H  -5.486567 -1.743904 -1.218368
H  -4.147178 -1.150522 -2.186986
H  -3.958939 -3.14687 1.010799
H  -5.344306 -2.073196 1.158295
H  -3.900183 -1.769098 2.107357
H  -2.18592 -0.293319 -2.073921
H  -1.82798 -2.180516 1.757283
H  -4.844184 2.33688 1.521831
H  -3.462396 2.263835 2.606699
H  0.241005 -0.258016 -2.271399
H  0.560606 -2.096264 1.602084
H  -1.306067 1.635139 0.514213
H  -4.519724 4.469114 0.554355
H  -3.205251 5.976128 -0.893941
H  -0.939253 5.318447 -1.642156
H  2.333564 2.186008 -2.156163
H  0.472308 3.116853 1.600417
H  4.354373 1.440428 -0.962411
H  2.468569 2.337251 2.77228
H  4.427213 1.485921 1.519401
elementType: Br F O C H
totalener: -3928.11416429 hartree
nucrepener: 3606.25660451 hartree
electener: -7534.37076880 hartree
twoeener: 5075.90222069 hartree
cpcmener: -0.02221938 hartree
kineticenergy: 3918.78843043 hartree
xcener: -198.384853589433 hartree
chargesum: 0.0000000
charge: -0.079710 -0.163840 -0.152235 -0.365820 -0.256165 -0.322451 0.388408 -0.101435 -0.061268 -0.333259 -0.362868 -0.195016 -0.207610 0.063902 -0.237787 -0.133778 0.241446 0.038914 -0.296806 -0.221928 0.344702 -0.109923 -0.259093 0.444469 0.350563 -0.281058 -0.226105 -0.122242 -0.145176 -0.199857 0.111493 0.107905 0.109021 0.103100 0.100832 0.113959 0.102479 0.094044 0.140932 0.143146 0.096168 0.105319 0.147819 0.144431 0.141169 0.139352 0.156547 0.142989 0.137707 0.157948 0.153779 0.157165 0.155718
qa: -0.0797 -0.1638 -0.1522 -0.3658 -0.2562 -0.3225 0.3884 -0.1014 -0.0613 -0.3333 -0.3629 -0.1950 -0.2076 0.0639 -0.2378 -0.1338 0.2414 0.0389 -0.2968 -0.2219 0.3447 -0.1099 -0.2591 0.4445 0.3506 -0.2811 -0.2261 -0.1222 -0.1452 -0.1999 0.1115 0.1079 0.1090 0.1031 0.1008 0.1140 0.1025 0.0940 0.1409 0.1431 0.0962 0.1053 0.1478 0.1444 0.1412 0.1394 0.1565 0.1430 0.1377 0.1579 0.1538 0.1572 0.1557
va: 1.1787 1.1267 1.1438 1.9366 2.1326 2.0674 3.5760 3.9633 3.6389 3.9185 3.9204 3.9521 4.0659 3.9048 4.0035 4.0036 3.6946 3.5884 3.9614 3.9636 3.6081 3.8794 4.0421 4.5438 3.6123 3.9390 3.8914 3.8152 3.9002 3.8659 0.9824 1.0036 1.0020 1.0037 1.0034 0.9994 1.0052 1.0130 1.0046 0.9990 0.9981 0.9889 1.0048 1.0189 1.0054 1.0023 0.9893 1.0078 1.0135 0.9977 0.9943 0.9903 0.9913
dispcorr: -0.033440315 hartree
energy: -3928.147604609764
dipole: -71.10594 69.03045 -2.07548 53.45884 -52.98816 0.47068 5.32530 -5.19778 0.12752
magnitude: 2.13200 au
magnitude: 5.41912 debye
