program: Gaussian 09
title: 000074760
version: EM64L-G09RevD.01
frameworkgroup: C1[X(C7H4I2O2)]
method: RPBEPBE
basis: SDD
operation: Freq
keyword: #pfreq=noraman
keyword: PBEPBE/SDD
title: #p freq=noraman PBEPBE/SDD
converged: YES YES NO NO
title: Mulliken charges:
elementType: I I O O C C C C C C C H H H H
charge: 0.170670 0.142718 -0.372433 -0.199302 0.397918 0.575039 -0.298699 -0.320304 -0.485398 -0.487051 -0.199442 0.294024 0.257454 0.173024 0.351780
chargesum: 0.00000
title: Mulliken charges with hydrogens summed into heavy atoms:
elementType: I I O O C C C C C C C
charge: 0.170670 0.142718 -0.020652 -0.199302 0.397918 0.575039 -0.004675 -0.062850 -0.485398 -0.487051 -0.026417
polarizability: 1.95158131e+02 -4.30212364e+00 1.73656478e+02 4.37676177e-03 1.21575672e-02 3.79482281e+01
1716.lowfreq: -4.6366 -0.0003 -0.0003 0.0003 2.2780 6.1036 71.5839 93.5648 95.6334
frequency: 71.5773 93.5646 95.6305 118.5782 160.7182 198.6562 222.8023 242.6812 274.0726 347.7483 399.0948 470.0921 496.0425 500.3611 567.6284 632.0827 680.4970 737.3828 777.9943 878.6691 886.2835 929.1689 989.3654 1028.4064 1126.8471 1192.7069 1235.0801 1284.3470 1359.1085 1393.4099 1400.7283 1447.5199 1537.0644 1577.4124 1615.3088 2878.4227 3150.6378 3162.7274 3429.0484
redmass: 11.1388 8.0998 30.1530 12.5521 3.5936 18.6893 3.8053 8.2594 8.7827 4.4395 7.2421 1.4240 2.4768 5.5229 3.4733 7.2238 9.6600 6.1656 5.9689 1.3946 7.4814 1.3586 1.8181 3.4452 1.5355 2.0735 1.5661 2.5353 2.0369 4.9501 1.9243 4.2559 7.4037 7.0515 7.5531 1.0852 1.0920 1.0929 1.0648
irintensity: 0.0059 5.1207 0.2884 3.9311 6.5860 0.1217 8.2690 1.9443 5.9906 0.8746 1.2170 94.6846 39.7682 39.7173 5.5437 29.5412 80.1063 16.5904 0.0634 17.2116 4.8099 3.1532 12.5499 8.9577 174.4563 271.0260 106.1855 43.6018 3.9594 13.3610 22.5864 63.7730 129.4208 99.3336 189.6786 119.7152 0.5885 2.8755 97.2813
temp: 298.150 k
press: 1.00000 atm
elementType: 53 53 8 8 6 6 6 6 6 6 6 1 1 1 1
symmnumber: 1
zpe: 236797.6 jmol-1
zpe.correction: 0.090191 hartree
zpe.thermalcorrener: 0.101008 hartree
zpe.thermalcorrenthalpy: 0.101953 hartree
zpe.thermalcorrgfe: 0.050161 hartree
zpe.sumelectzpe: -441.806374 hartree
zpe.sumelectthermal: -441.795557 hartree
zpe.sumelectthermalent: -441.794613 hartree
zpe.sumelectthermalfe: -441.846404 hartree
dipole: 3.6796 -1.9326 0.0000
dipole: 4.1563
quadrupole: -86.3515 -102.3433 -95.0514
quadrupole: 7.0541 0.0011 -0.0005
quadrupole: 8.2306 -7.7612 -0.4694 7.0541 0.0011 -0.0005
hfenergy: -441.8965651 hartree
pointgroup: C01 [X(C7H4I2O2)]
dipole: 1.1297698 1.1821627 -0.0000097 debye
dipolederiv: 0.007649 0.1298969 -0.0000063 0.1762079 -0.4435532 -0.0000487 -0.0000235 0.000032 0.0520246 -0.2610114 -0.2290096 0.0000131 -0.2398588 -0.3776361 0.0000047 -0.0000281 0.0000033 0.049559 -1.3623957 0.0756395 0.0001005 0.22518 -0.1926331 -0.0000034 0.0001417 0.0000322 -0.3653258 -1.2994256 -0.0435942 0.0000781 -0.5071139 -0.4184384 0.0000298 0.0000968 -0.0000089 -0.3252329 -1.0786959 0.1430052 0.0000897 0.3674083 -0.0987315 -0.0000189 0.0000843 -0.0000179 0.0068907 1.058556 -0.2063075 -0.0001014 -0.2931566 -0.3943121 0.0000348 -0.0001677 0. 0.1783429 0.1129045 0.0607235 -0.0000191 -0.0479139 -0.2361585 -0.0000346 -0.0000072 -0.0000128 -0.0314529 0.1676122 -0.0559615 0.000008 -0.1220144 -0.2137351 -0.0000068 0.0000113 -0.0000203 -0.0704272 -0.2599307 -0.2516919 0.0000141 -0.5898379 1.1092436 0.0001146 -0.0000177 0.0000251 -0.1963888 0.2849613 0.5779721 -0.0000161 0.9800919 0.5735596 -0.0000612 0.0000812 -0.0000041 -0.1943974 1.9928582 -0.1254216 -0.0001675 -0.0354092 0.5966003 0.000055 -0.0001694 0.0000734 0.1089661 0.1073047 -0.0839342 -0.0000014 -0.0177683 0.0692281 0.0000042 0.0000058 -0.0000143 0.1546085 0.1062451 0.0651782 0.0000064 0.0298989 -0.0169787 -0.0000094 0.0000003 -0.000027 0.1605441 0.0152971 -0.0090208 0.000009 0.153184 -0.2694446 -0.0000509 -0.0000009 -0.0000274 0.1116852 0.4080713 -0.0474744 -0.0000072 -0.0788981 0.3129896 -0.0000092 -0.0000068 -0.0000335 0.3606039 unknown
polarizability: 177.5676727|9.343874|191.2469363|-0.0104811|0.0075571|37.9482281 unknown
InChI: InChI=1S/C7H4I2O2/c8-5-1-4(3-10)2-6(9)7(5)11/h1-3,11H
charge 0 multiplicity 1
15 atoms
I  1.094416 -3.296567 -0.000251
I  2.453534 2.712113 -0.000037
O  2.755964 -0.590034 -0.000244
O  -3.72092 -0.106355 0.000345
C  -1.345882 0.405495 0.000157
C  1.426719 -0.220889 -0.000105
C  -0.919641 -0.950842 0.000047
C  -0.387062 1.450148 0.000144
C  0.446229 -1.259129 -0.000079
C  0.979428 1.13301 0.000008
C  -2.790396 0.741996 0.000291
H  -1.683291 -1.734676 0.000058
H  -0.718872 2.493897 0.000236
H  -3.013094 1.838963 0.000457
H  3.35197 0.21007 -0.000226
