program: Orca
programVersion: 5.0.2
elementType: Br F F O O O C C C C C C C C C C C C C C C C C C C C C C C C H H H H H H H H H H H H H H H H H H H H H H H
charge: 0
multiplicity: 1
keywords: wb97x-d3
keywords: def2-TZVPP
keywords: def2/J RIJCOSX
keywords: DEFGRID2
keywords: scfconv7
keywords: smallprint printgap noloewdin
keywords: NOSOSCF
formula: C24H23BrF2O3
InChI: InChI=1/C24H23BrF2O3/c1-23(2,19-11-13-21(14-12-19)30-24(25,26)27)17-28-16-18-7-6-10-22(15-18)29-20-8-4-3-5-9-20/h3-15H,16-17H2,1-2H3
53 atoms
Br 3.868177 -1.848699 -0.195559
F  1.727115 -0.937753 -1.541484
F  1.929183 -3.075292 -1.554393
O  -4.286495 0.434668 -0.848013
O  1.258805 -2.069004 0.313183
O  0.448001 1.412057 0.442258
C  -4.431094 -1.579221 0.461722
C  -4.715113 -0.074751 0.393392
C  -2.92119 -1.77589 0.387633
C  -5.17034 -2.30144 -0.666211
C  -4.988857 -2.093406 1.792802
C  -2.276538 -2.161285 -0.782221
C  -2.113348 -1.494389 1.490806
C  -4.196285 1.834394 -0.89451
C  -0.89272 -2.269606 -0.869709
C  -0.734613 -1.587375 1.42723
C  -0.127342 -1.974895 0.244266
C  -2.987172 2.380674 -0.174448
C  -1.786587 1.679238 -0.1914
C  -3.048597 3.609378 0.473838
C  -0.670226 2.194795 0.45045
C  -1.922942 4.121218 1.103696
C  -0.72734 3.418336 1.108383
C  2.030753 -1.988652 -0.774538
C  1.692386 1.978444 0.453457
C  2.04064 2.997786 -0.425067
C  2.623615 1.45619 1.337768
C  3.333756 3.498481 -0.402556
C  3.917462 1.958362 1.341111
C  4.276685 2.984118 0.478636
H  -5.792962 0.102148 0.524887
H  -4.205146 0.427546 1.226445
H  -6.246718 -2.160049 -0.551126
H  -4.905943 -1.942848 -1.66036
H  -4.97721 -3.37568 -0.638663
H  -4.608872 -1.542825 2.654078
H  -4.746611 -3.14723 1.937219
H  -6.076292 -1.999736 1.808832
H  -2.84475 -2.393606 -1.671996
H  -2.552309 -1.177847 2.427635
H  -4.138125 2.103122 -1.953216
H  -5.104527 2.310118 -0.500729
H  -0.46751 -2.589249 -1.810035
H  -0.132468 -1.35633 2.296657
H  -1.707453 0.724586 -0.697985
H  -3.979141 4.16398 0.49422
H  -1.977324 5.074101 1.61451
H  0.135664 3.820212 1.623783
H  1.316237 3.396596 -1.124473
H  2.339911 0.6592 2.013385
H  3.6056 4.293078 -1.085619
H  4.64439 1.545269 2.028423
H  5.284565 3.377944 0.487696
elementType: Br F O C H
totalener: -3928.11293600 hartree
nucrepener: 3608.44463012 hartree
electener: -7536.55756612 hartree
twoeener: 5078.66188531 hartree
cpcmener: -0.02240265 hartree
kineticenergy: 3918.79084681 hartree
xcener: -198.382755403270 hartree
chargesum: -0.0000000
charge: -0.040418 -0.160881 -0.161084 -0.367715 -0.272342 -0.311320 0.397421 -0.109399 -0.014287 -0.358382 -0.338814 -0.269270 -0.199536 0.062465 -0.125940 -0.227826 0.235949 0.042427 -0.317324 -0.213948 0.308241 -0.128887 -0.228425 0.435749 0.295854 -0.201834 -0.273204 -0.142338 -0.107023 -0.176797 0.105999 0.112406 0.102075 0.094182 0.115764 0.100601 0.111555 0.102350 0.138945 0.140272 0.104939 0.096958 0.134173 0.147154 0.144133 0.138680 0.157307 0.153121 0.156990 0.142990 0.157838 0.153421 0.157036
qa: -0.0404 -0.1609 -0.1611 -0.3677 -0.2723 -0.3113 0.3974 -0.1094 -0.0143 -0.3584 -0.3388 -0.2693 -0.1995 0.0625 -0.1259 -0.2278 0.2359 0.0424 -0.3173 -0.2139 0.3082 -0.1289 -0.2284 0.4357 0.2959 -0.2018 -0.2732 -0.1423 -0.1070 -0.1768 0.1060 0.1124 0.1021 0.0942 0.1158 0.1006 0.1116 0.1024 0.1389 0.1403 0.1049 0.0970 0.1342 0.1472 0.1441 0.1387 0.1573 0.1531 0.1570 0.1430 0.1578 0.1534 0.1570
va: 1.1864 1.1330 1.1312 1.9426 2.1376 2.0471 3.5535 3.9816 3.5874 3.9133 3.9127 4.0992 3.9735 3.9020 3.9716 3.9720 3.7363 3.5731 4.0346 3.9529 3.7223 3.9052 3.9389 4.5370 3.5945 3.9500 3.9773 3.8949 3.8523 3.9011 1.0026 0.9813 1.0047 1.0131 0.9994 1.0031 1.0011 1.0047 1.0037 1.0036 0.9892 0.9970 1.0267 1.0032 1.0114 1.0027 0.9906 0.9998 0.9979 1.0107 0.9901 0.9917 0.9899
dispcorr: -0.033004761 hartree
energy: -3928.145940758741
dipole: -83.65126 82.36698 -1.28427 31.41656 -30.42329 0.99327 12.95268 -12.20327 0.74941
magnitude: 1.78817 au
magnitude: 4.54517 debye
