program: Orca
programVersion: 5.0.2
elementType: Br F F O O O C C C C C C C C C C C C C C C C C C C C C C C C H H H H H H H H H H H H H H H H H H H H H H H
charge: 0
multiplicity: 1
keywords: wb97x-d3
keywords: def2-TZVPP
keywords: def2/J RIJCOSX
keywords: DEFGRID2
keywords: scfconv7
keywords: smallprint printgap noloewdin
keywords: NOSOSCF
formula: C24H23BrF2O3
InChI: InChI=1/C24H23BrF2O3/c1-23(2,19-11-13-21(14-12-19)30-24(25,26)27)17-28-16-18-7-6-10-22(15-18)29-20-8-4-3-5-9-20/h3-15H,16-17H2,1-2H3
53 atoms
Br 0.493371 -2.893859 3.099045
F  1.682682 -3.917776 0.933822
F  1.033443 -5.417739 2.328821
O  -2.656526 1.190068 -0.000943
O  -0.450881 -4.534709 1.066792
O  2.511002 3.5546 -1.661128
C  -3.503882 -0.46518 -1.515267
C  -2.773104 0.870607 -1.366637
C  -2.695744 -1.546782 -0.807689
C  -3.599992 -0.781224 -3.012426
C  -4.924264 -0.336475 -0.964867
C  -3.183469 -2.258517 0.28434
C  -1.406873 -1.851636 -1.250014
C  -1.862887 2.323539 0.24737
C  -2.421224 -3.233109 0.914609
C  -0.632602 -2.82636 -0.643094
C  -1.151126 -3.505424 0.446922
C  -0.392408 2.06936 0.027619
C  0.364906 2.957271 -0.724478
C  0.214054 0.942918 0.579682
C  1.72688 2.734666 -0.899799
C  1.566739 0.719245 0.380382
C  2.334459 1.615374 -0.350977
C  0.675483 -4.285705 1.735221
C  2.262704 4.899783 -1.7079
C  2.024301 5.644244 -0.558391
C  2.317418 5.514168 -2.950763
C  1.829799 7.013253 -0.666612
C  2.1335 6.886914 -3.042481
C  1.882673 7.640719 -1.904742
H  -1.786023 0.808956 -1.843871
H  -3.333045 1.654332 -1.898076
H  -4.094514 -1.739732 -3.176512
H  -4.183668 -0.015824 -3.527934
H  -2.62292 -0.825536 -3.4950
H  -5.491093 -1.258662 -1.105316
H  -5.454401 0.453194 -1.500607
H  -4.954143 -0.085254 0.095286
H  -4.174852 -2.065559 0.669814
H  -0.981032 -1.32531 -2.094751
H  -2.188711 3.179207 -0.359303
H  -2.034811 2.593045 1.292784
H  -2.820281 -3.775437 1.762349
H  0.348287 -3.050221 -1.038506
H  -0.115736 3.818063 -1.175075
H  -0.368271 0.242144 1.164622
H  2.038033 -0.157161 0.807345
H  3.393663 1.445971 -0.49889
H  1.993218 5.167604 0.413511
H  2.507033 4.922141 -3.837486
H  1.642516 7.592861 0.22818
H  2.179175 7.365047 -4.012514
H  1.733204 8.709708 -1.980752
elementType: Br F O C H
totalener: -3928.11664133 hartree
nucrepener: 3409.46309548 hartree
electener: -7337.57973680 hartree
twoeener: 4878.35241564 hartree
cpcmener: -0.02273397 hartree
kineticenergy: 3918.78693234 hartree
xcener: -198.378905967877 hartree
chargesum: 0.0000000
charge: -0.081598 -0.159334 -0.149364 -0.365355 -0.270009 -0.329902 0.406344 -0.093638 -0.055692 -0.334727 -0.371384 -0.169297 -0.232270 0.070646 -0.138857 -0.156941 0.143826 0.001943 -0.163026 -0.256054 0.266497 -0.094423 -0.250000 0.435439 0.276061 -0.188090 -0.243249 -0.144308 -0.123920 -0.182786 0.107836 0.106295 0.109233 0.103071 0.101802 0.109520 0.102304 0.098438 0.144612 0.139890 0.093998 0.108718 0.148255 0.149066 0.137680 0.127457 0.143954 0.145422 0.155745 0.145969 0.159125 0.157185 0.157892
qa: -0.0816 -0.1593 -0.1494 -0.3654 -0.2700 -0.3299 0.4063 -0.0936 -0.0557 -0.3347 -0.3714 -0.1693 -0.2323 0.0706 -0.1389 -0.1569 0.1438 0.0019 -0.1630 -0.2561 0.2665 -0.0944 -0.2500 0.4354 0.2761 -0.1881 -0.2432 -0.1443 -0.1239 -0.1828 0.1078 0.1063 0.1092 0.1031 0.1018 0.1095 0.1023 0.0984 0.1446 0.1399 0.0940 0.1087 0.1483 0.1491 0.1377 0.1275 0.1440 0.1454 0.1557 0.1460 0.1591 0.1572 0.1579
va: 1.1750 1.1285 1.1471 1.9337 2.1065 2.0742 3.5375 3.9656 3.6096 3.9234 3.9271 3.9557 3.9811 3.8960 4.0115 3.9997 3.7872 3.6165 3.8656 3.9397 3.7281 3.8738 4.0350 4.5505 3.7009 3.9137 4.0086 3.8909 3.8842 3.9028 0.9823 1.0027 1.0025 1.0037 1.0029 0.9994 1.0062 1.0109 0.9981 1.0075 1.0008 0.9889 1.0049 1.0104 1.0097 1.0092 0.9961 1.0070 0.9973 1.0079 0.9902 0.9895 0.9905
dispcorr: -0.029080678 hartree
energy: -3928.145722004942
dipole: -32.81793 31.66355 -1.15439 67.14041 -65.63129 1.50913 -56.71693 55.70620 -1.01073
magnitude: 2.15212 au
magnitude: 5.47027 debye
