program: Orca
programVersion: 5.0.2
elementType: Br F F O O O C C C C C C C C C C C C C C C C C C C C C C C C H H H H H H H H H H H H H H H H H H H H H H H
charge: 0
multiplicity: 1
keywords: wb97x-d3
keywords: def2-TZVPP
keywords: def2/J RIJCOSX
keywords: DEFGRID2
keywords: scfconv7
keywords: smallprint printgap noloewdin
keywords: NOSOSCF
formula: C24H23BrF2O3
InChI: InChI=1/C24H23BrF2O3/c1-23(2,19-11-13-21(14-12-19)30-24(25,26)27)17-28-16-18-7-6-10-22(15-18)29-20-8-4-3-5-9-20/h3-15H,16-17H2,1-2H3
53 atoms
Br 1.287521 -3.430963 -1.363778
F  1.857282 -5.360782 0.422713
F  2.022545 -3.372544 1.215053
O  -3.130963 0.432534 -1.293953
O  0.04395 -4.351575 0.939685
O  0.551831 4.714196 0.024095
C  -4.122808 -0.462536 0.693154
C  -3.578515 0.784653 -0.00694
C  -3.013135 -1.507069 0.748932
C  -5.367296 -0.959055 -0.043178
C  -4.536709 -0.06178 2.113014
C  -3.108431 -2.739239 0.109252
C  -1.836524 -1.236726 1.450931
C  -2.455302 1.46649 -1.96832
C  -2.076189 -3.665927 0.162057
C  -0.796225 -2.149327 1.522924
C  -0.92821 -3.361294 0.865855
C  -1.134227 1.804507 -1.325333
C  -0.837466 3.111798 -0.968974
C  -0.210401 0.796072 -1.058379
C  0.367354 3.411945 -0.343911
C  0.983436 1.102846 -0.427267
C  1.282804 2.408354 -0.058568
C  1.269104 -4.170418 0.446427
C  1.810789 5.24852 0.073065
C  2.713914 5.094303 -0.972162
C  2.13648 6.011396 1.184754
C  3.956929 5.703878 -0.887643
C  3.379168 6.626683 1.249972
C  4.296192 6.469941 0.22039
H  -4.3679 1.548701 -0.066496
H  -2.766067 1.216625 0.591552
H  -5.802875 -1.831684 0.447116
H  -6.127961 -0.176083 -0.042509
H  -5.174895 -1.222821 -1.083343
H  -5.323321 0.695106 2.082661
H  -3.708469 0.351913 2.689534
H  -4.925556 -0.920937 2.661483
H  -3.994872 -3.003017 -0.450341
H  -1.711166 -0.290822 1.962544
H  -2.294257 1.107182 -2.987926
H  -3.077068 2.368986 -2.040205
H  -2.17102 -4.619426 -0.341736
H  0.087739 -1.905991 2.096326
H  -1.550131 3.905463 -1.16357
H  -0.427578 -0.227998 -1.335569
H  1.695763 0.317325 -0.208538
H  2.214612 2.626289 0.447528
H  2.45409 4.509243 -1.845729
H  1.420531 6.125466 1.989175
H  4.661486 5.582931 -1.700429
H  3.631552 7.223904 2.116695
H  5.266943 6.944516 0.277702
elementType: Br F O C H
totalener: -3928.11574005 hartree
nucrepener: 3414.75316848 hartree
electener: -7342.86890853 hartree
twoeener: 4883.68839813 hartree
cpcmener: -0.02239541 hartree
kineticenergy: 3918.78747287 hartree
xcener: -198.379742185829 hartree
chargesum: -0.0000000
charge: -0.078970 -0.150294 -0.159851 -0.364238 -0.268450 -0.328965 0.400059 -0.091650 -0.048519 -0.369048 -0.336847 -0.173280 -0.233555 0.064793 -0.137188 -0.153099 0.138337 0.008362 -0.220825 -0.236166 0.266974 -0.116337 -0.193130 0.431521 0.271044 -0.185310 -0.239380 -0.146983 -0.126674 -0.178969 0.106023 0.106367 0.108693 0.102537 0.098369 0.103888 0.102013 0.109546 0.144861 0.140384 0.110164 0.094340 0.148351 0.150680 0.128526 0.122772 0.146001 0.155405 0.157282 0.145555 0.159165 0.157817 0.157894
qa: -0.0790 -0.1503 -0.1599 -0.3642 -0.2684 -0.3290 0.4001 -0.0917 -0.0485 -0.3690 -0.3368 -0.1733 -0.2336 0.0648 -0.1372 -0.1531 0.1383 0.0084 -0.2208 -0.2362 0.2670 -0.1163 -0.1931 0.4315 0.2710 -0.1853 -0.2394 -0.1470 -0.1267 -0.1790 0.1060 0.1064 0.1087 0.1025 0.0984 0.1039 0.1020 0.1095 0.1449 0.1404 0.1102 0.0943 0.1484 0.1507 0.1285 0.1228 0.1460 0.1554 0.1573 0.1456 0.1592 0.1578 0.1579
va: 1.1762 1.1452 1.1290 1.9321 2.1068 2.0714 3.5449 3.9648 3.6033 3.9248 3.9251 3.9628 3.9916 3.8880 4.0107 3.9914 3.7897 3.6434 3.9991 3.9370 3.7415 3.8731 3.9254 4.5547 3.6993 3.9147 4.0075 3.8910 3.8870 3.9002 1.0035 0.9822 0.9995 1.0062 1.0112 1.0032 1.0025 1.0024 0.9977 1.0071 0.9897 0.9998 1.0045 1.0107 1.0198 1.0109 0.9983 0.9968 0.9964 1.0077 0.9902 0.9893 0.9905
dispcorr: -0.029284311 hartree
energy: -3928.145024361617
dipole: -44.76455 44.03029 -0.73426 69.28199 -68.04953 1.23245 15.98493 -15.75443 0.23050
magnitude: 1.45300 au
magnitude: 3.69323 debye
