program: Orca
programVersion: 5.0.2
elementType: Br F F O O O C C C C C C C C C C C C C C C C C C C C C C C C H H H H H H H H H H H H H H H H H H H H H H H
charge: 0
multiplicity: 1
keywords: wb97x-d3
keywords: def2-TZVPP
keywords: def2/J RIJCOSX
keywords: DEFGRID2
keywords: scfconv7
keywords: smallprint printgap noloewdin
keywords: NOSOSCF
formula: C24H23BrF2O3
InChI: InChI=1/C24H23BrF2O3/c1-23(2,19-11-13-21(14-12-19)30-24(25,26)27)17-28-16-18-7-6-10-22(15-18)29-20-8-4-3-5-9-20/h3-15H,16-17H2,1-2H3
53 atoms
Br 3.830504 -1.617059 -2.225328
F  1.83271 -3.313968 -1.640482
F  2.7472 -2.434991 0.084261
O  -3.887011 0.584049 0.798514
O  1.414179 -1.181688 -1.185247
O  0.473937 2.822318 -0.296465
C  -3.781434 -1.78503 1.092411
C  -4.574824 -0.607712 0.514038
C  -2.367453 -1.709251 0.527891
C  -4.467817 -3.082733 0.655841
C  -3.810814 -1.719417 2.619584
C  -1.256611 -1.441368 1.321609
C  -2.161399 -1.834594 -0.847651
C  -4.293896 1.703302 0.058882
C  0.012956 -1.291835 0.776768
C  -0.904459 -1.694366 -1.410557
C  0.172969 -1.415732 -0.588607
C  -3.172819 2.704882 0.001537
C  -1.84968 2.281558 -0.073398
C  -3.455083 4.067378 -0.035203
C  -0.833417 3.2206 -0.173553
C  -2.430563 4.994315 -0.153983
C  -1.108681 4.577923 -0.214498
C  2.317965 -2.164953 -1.156031
C  1.093709 2.169424 0.727817
C  0.589321 2.107028 2.021693
C  2.314471 1.576684 0.420811
C  1.311695 1.434742 2.999602
C  3.022849 0.91197 1.407979
C  2.525814 0.83326 2.703456
H  -4.691552 -0.733448 -0.571445
H  -5.586896 -0.597328 0.943815
H  -5.491112 -3.121472 1.035293
H  -4.519142 -3.185717 -0.428671
H  -3.938151 -3.952723 1.046927
H  -3.254966 -2.545767 3.066117
H  -4.842095 -1.796695 2.968696
H  -3.402998 -0.789813 3.017331
H  -1.358739 -1.325394 2.391577
H  -2.994578 -2.033048 -1.510039
H  -4.560141 1.413052 -0.96776
H  -5.190157 2.167008 0.492072
H  0.848132 -1.049495 1.420721
H  -0.770608 -1.777119 -2.481642
H  -1.602514 1.2264 -0.0610
H  -4.482309 4.405899 0.027851
H  -2.659696 6.051554 -0.185535
H  -0.301718 5.295144 -0.296667
H  -0.35268 2.572055 2.281203
H  2.701391 1.638376 -0.588498
H  0.91378 1.387628 4.005282
H  3.970919 0.451885 1.160218
H  3.079355 0.309894 3.471824
elementType: Br F O C H
totalener: -3928.11398830 hartree
nucrepener: 3592.52198652 hartree
electener: -7520.63597482 hartree
twoeener: 5062.32506694 hartree
cpcmener: -0.02249819 hartree
kineticenergy: 3918.80744942 hartree
xcener: -198.383193352066 hartree
chargesum: -0.0000000
charge: -0.043297 -0.159511 -0.163873 -0.363572 -0.293201 -0.328163 0.391031 -0.080780 -0.073511 -0.328835 -0.372432 -0.179595 -0.172595 0.073789 -0.198390 -0.205130 0.241986 -0.018211 -0.111290 -0.182890 0.192094 -0.146678 -0.188644 0.424997 0.336724 -0.210637 -0.252662 -0.165334 -0.110992 -0.185348 0.104329 0.102464 0.103133 0.100416 0.108080 0.110465 0.102696 0.097972 0.140936 0.138094 0.090555 0.091447 0.163521 0.147965 0.098690 0.138639 0.156146 0.145093 0.147590 0.133004 0.155841 0.144980 0.152893
qa: -0.0433 -0.1595 -0.1639 -0.3636 -0.2932 -0.3282 0.3910 -0.0808 -0.0735 -0.3288 -0.3724 -0.1796 -0.1726 0.0738 -0.1984 -0.2051 0.2420 -0.0182 -0.1113 -0.1829 0.1921 -0.1467 -0.1886 0.4250 0.3367 -0.2106 -0.2527 -0.1653 -0.1110 -0.1853 0.1043 0.1025 0.1031 0.1004 0.1081 0.1105 0.1027 0.0980 0.1409 0.1381 0.0906 0.0914 0.1635 0.1480 0.0987 0.1386 0.1561 0.1451 0.1476 0.1330 0.1558 0.1450 0.1529
va: 1.1869 1.1354 1.1301 1.9430 2.0874 2.0717 3.5719 3.9555 3.6978 3.9232 3.9251 3.9294 3.9612 3.9039 4.0127 4.1122 3.6458 3.7241 3.8746 3.9224 3.7857 3.9132 3.9795 4.5472 3.6381 3.8439 3.9171 3.8902 3.8344 3.8824 0.9937 0.9988 1.0031 1.0032 1.0026 0.9990 1.0062 1.0106 1.0027 1.0044 0.9901 0.9939 0.9994 1.0030 1.0232 1.0055 0.9901 1.0045 1.0041 1.0187 0.9917 0.9964 0.9923
dispcorr: -0.033654614 hartree
energy: -3928.147642909692
dipole: -85.03440 82.72094 -2.31346 24.85286 -24.86179 -0.00893 41.94580 -41.61630 0.32949
magnitude: 2.33682 au
magnitude: 5.93973 debye
