program: Orca
programVersion: 5.0.2
elementType: Br F F O O O C C C C C C C C C C C C C C C C C C C C C C C C H H H H H H H H H H H H H H H H H H H H H H H
charge: 0
multiplicity: 1
keywords: wb97x-d3
keywords: def2-TZVPP
keywords: def2/J RIJCOSX
keywords: DEFGRID2
keywords: scfconv7
keywords: smallprint printgap noloewdin
keywords: NOSOSCF
formula: C24H23BrF2O3
InChI: InChI=1/C24H23BrF2O3/c1-23(2,19-11-13-21(14-12-19)30-24(25,26)27)17-28-16-18-7-6-10-22(15-18)29-20-8-4-3-5-9-20/h3-15H,16-17H2,1-2H3
53 atoms
Br 2.20457 -3.373694 -2.344075
F  4.092897 -2.061817 -0.955072
F  2.733866 -0.761123 -1.985615
O  -3.492566 0.775701 0.662561
O  2.168847 -1.762756 -0.082239
O  0.69563 3.565071 0.462737
C  -3.46972 -1.617782 0.77893
C  -4.117881 -0.377758 0.161851
C  -1.962883 -1.616967 0.540636
C  -4.075761 -2.843901 0.08555
C  -3.816948 -1.669099 2.269055
C  -1.068311 -2.107421 1.489336
C  -1.423981 -1.165905 -0.663584
C  -3.931991 1.968965 0.067918
C  0.295179 -2.160054 1.245448
C  -0.060739 -1.18119 -0.920188
C  0.79314 -1.697604 0.041243
C  -2.931578 3.058867 0.334642
C  -1.569482 2.778763 0.303255
C  -3.356001 4.362636 0.570732
C  -0.65233 3.795733 0.525484
C  -2.428229 5.374747 0.768657
C  -1.069405 5.097557 0.759837
C  2.810225 -1.872059 -1.241122
C  1.254665 2.524592 1.148591
C  0.725297 2.025403 2.333124
C  2.437904 2.008801 0.633076
C  1.391119 1.00228 2.994127
C  3.09868 0.998118 1.313969
C  2.577921 0.485618 2.494632
H  -4.050568 -0.405607 -0.934852
H  -5.190533 -0.383688 0.403178
H  -5.159992 -2.871108 0.218204
H  -3.870358 -2.843824 -0.98655
H  -3.668626 -3.766784 0.501173
H  -3.525034 -2.615892 2.7245
H  -4.896773 -1.576896 2.398694
H  -3.344753 -0.865874 2.836085
H  -1.420892 -2.470579 2.444561
H  -2.06615 -0.776106 -1.442545
H  -4.041923 1.839662 -1.018866
H  -4.91978 2.263976 0.446468
H  0.968696 -2.557972 1.993826
H  0.290237 -0.782211 -1.860893
H  -1.2201 1.772452 0.105255
H  -4.415191 4.587725 0.601942
H  -2.764589 6.38698 0.952088
H  -0.340873 5.88002 0.930862
H  -0.190976 2.424352 2.749047
H  2.842037 2.407527 -0.289178
H  0.975075 0.614192 3.915092
H  4.022489 0.603671 0.910899
H  3.090853 -0.309743 3.018994
elementType: Br F O C H
totalener: -3928.11486317 hartree
nucrepener: 3574.66715904 hartree
electener: -7502.78202221 hartree
twoeener: 5044.29149574 hartree
cpcmener: -0.02427345 hartree
kineticenergy: 3918.78914966 hartree
xcener: -198.382150587958 hartree
chargesum: 0.0000000
charge: -0.077915 -0.151376 -0.162303 -0.366663 -0.259440 -0.327458 0.344569 -0.046526 -0.042335 -0.324985 -0.378104 -0.140917 -0.273762 0.088290 -0.210760 -0.096862 0.184126 0.003951 -0.174592 -0.217786 0.239227 -0.121858 -0.237544 0.433234 0.300712 -0.182890 -0.257363 -0.153996 -0.107942 -0.202063 0.104433 0.102868 0.103610 0.101509 0.104733 0.099177 0.100178 0.111802 0.143444 0.140440 0.090400 0.091659 0.148260 0.147885 0.138068 0.138489 0.156333 0.144763 0.150470 0.142331 0.156927 0.149595 0.153957
qa: -0.0779 -0.1514 -0.1623 -0.3667 -0.2594 -0.3275 0.3446 -0.0465 -0.0423 -0.3250 -0.3781 -0.1409 -0.2738 0.0883 -0.2108 -0.0969 0.1841 0.0040 -0.1746 -0.2178 0.2392 -0.1219 -0.2375 0.4332 0.3007 -0.1829 -0.2574 -0.1540 -0.1079 -0.2021 0.1044 0.1029 0.1036 0.1015 0.1047 0.0992 0.1002 0.1118 0.1434 0.1404 0.0904 0.0917 0.1483 0.1479 0.1381 0.1385 0.1563 0.1448 0.1505 0.1423 0.1569 0.1496 0.1540
va: 1.1793 1.1450 1.1277 1.9497 2.1115 2.0787 3.5812 3.9072 3.6527 3.9206 3.9314 3.9109 4.0564 3.8821 4.0063 3.9117 3.7059 3.7231 3.9089 3.9579 3.7620 3.8968 4.0014 4.5615 3.6804 3.8565 3.9740 3.8491 3.8215 3.8404 0.9941 0.9977 1.0032 1.0036 1.0040 1.0009 1.0061 1.0090 0.9982 1.0037 0.9894 0.9953 1.0062 1.0158 1.0137 1.0061 0.9896 1.0066 0.9998 1.0101 0.9911 0.9983 0.9927
dispcorr: -0.032406064 hartree
energy: -3928.147269238427
dipole: -67.17503 64.86152 -2.31351 41.64476 -41.98983 -0.34506 43.60799 -43.41345 0.19455
magnitude: 2.34718 au
magnitude: 5.96606 debye
