program: Orca
programVersion: 5.0.2
elementType: Br F F O O O C C C C C C C C C C C C C C C C C C C C C C C C H H H H H H H H H H H H H H H H H H H H H H H
charge: 0
multiplicity: 1
keywords: wb97x-d3
keywords: def2-TZVPP
keywords: def2/J RIJCOSX
keywords: DEFGRID2
keywords: scfconv7
keywords: smallprint printgap noloewdin
keywords: NOSOSCF
formula: C24H23BrF2O3
InChI: InChI=1/C24H23BrF2O3/c1-23(2,19-11-13-21(14-12-19)30-24(25,26)27)17-28-16-18-7-6-10-22(15-18)29-20-8-4-3-5-9-20/h3-15H,16-17H2,1-2H3
53 atoms
Br 1.511522 -3.975224 1.668816
F  2.689991 -2.488506 -0.230947
F  2.212258 -4.476784 -0.877425
O  -3.675479 1.415565 -0.821619
O  0.61611 -3.056528 -0.795461
O  1.725169 3.215904 -1.49301
C  -3.335871 0.447042 1.357788
C  -3.310365 1.719384 0.504877
C  -2.281561 -0.511717 0.816283
C  -4.740581 -0.156203 1.344151
C  -3.005382 0.847737 2.79976
C  -2.605585 -1.690002 0.150581
C  -0.926631 -0.199119 0.935848
C  -3.097202 2.252972 -1.79925
C  -1.624171 -2.530978 -0.354989
C  0.070888 -1.014237 0.426255
C  -0.294104 -2.188453 -0.212221
C  -1.654448 1.89796 -2.048974
C  -0.636266 2.752077 -1.648038
C  -1.333133 0.678234 -2.642985
C  0.692886 2.385725 -1.834913
C  -0.007581 0.330554 -2.84088
C  1.014752 1.176809 -2.429833
C  1.743702 -3.437187 -0.1969
C  1.677581 3.914213 -0.318023
C  2.158464 5.215695 -0.330977
C  1.222928 3.340562 0.863312
C  2.181971 5.946479 0.848706
C  1.239098 4.087128 2.032086
C  1.716411 5.391136 2.032156
H  -4.005697 2.458928 0.927169
H  -2.308888 2.164871 0.554836
H  -4.79543 -1.050978 1.966867
H  -5.453572 0.565067 1.747648
H  -5.085596 -0.424739 0.346061
H  -3.778343 1.508144 3.197527
H  -2.05545 1.377373 2.883218
H  -2.954569 -0.028803 3.447248
H  -3.637303 -1.984338 0.019156
H  -0.62238 0.712423 1.433482
H  -3.681575 2.107655 -2.710508
H  -3.187387 3.311431 -1.525234
H  -1.897493 -3.447341 -0.862622
H  1.102875 -0.707704 0.525157
H  -0.884205 3.705429 -1.195245
H  -2.120972 0.005048 -2.958502
H  0.240822 -0.613438 -3.308706
H  2.052165 0.901929 -2.574065
H  2.514174 5.650372 -1.256625
H  0.865399 2.3190 0.878053
H  2.558137 6.961325 0.836385
H  0.881933 3.638361 2.950149
H  1.7297 5.967427 2.94778
elementType: Br F O C H
totalener: -3928.11388316 hartree
nucrepener: 3553.90554674 hartree
electener: -7482.01942990 hartree
twoeener: 5022.52582201 hartree
cpcmener: -0.02463150 hartree
kineticenergy: 3918.79850650 hartree
xcener: -198.384020249189 hartree
chargesum: 0.0000000
charge: -0.075886 -0.158859 -0.149477 -0.374492 -0.264750 -0.332555 0.389957 -0.085108 -0.031912 -0.361745 -0.338036 -0.183968 -0.242924 0.057082 -0.156420 -0.157615 0.163379 0.071652 -0.210199 -0.280062 0.285641 -0.101328 -0.257338 0.419868 0.251593 -0.215465 -0.157832 -0.141398 -0.190878 -0.159735 0.108712 0.094652 0.112923 0.102980 0.095700 0.104099 0.100355 0.109294 0.140470 0.153088 0.108505 0.098556 0.147627 0.155828 0.144506 0.138557 0.154209 0.143673 0.144577 0.160508 0.157167 0.155293 0.157533
qa: -0.0759 -0.1589 -0.1495 -0.3745 -0.2648 -0.3326 0.3900 -0.0851 -0.0319 -0.3617 -0.3380 -0.1840 -0.2429 0.0571 -0.1564 -0.1576 0.1634 0.0717 -0.2102 -0.2801 0.2856 -0.1013 -0.2573 0.4199 0.2516 -0.2155 -0.1578 -0.1414 -0.1909 -0.1597 0.1087 0.0947 0.1129 0.1030 0.0957 0.1041 0.1004 0.1093 0.1405 0.1531 0.1085 0.0986 0.1476 0.1558 0.1445 0.1386 0.1542 0.1437 0.1446 0.1605 0.1572 0.1553 0.1575
va: 1.1800 1.1285 1.1444 1.9309 2.0923 2.0779 3.5562 3.9957 3.5811 3.9173 3.9237 3.9711 4.0175 3.9091 4.0248 3.8987 3.7201 3.5119 3.8744 3.9339 3.6876 3.8287 3.9884 4.5828 3.7314 3.9811 3.8393 3.9004 3.9400 3.8845 1.0047 0.9810 0.9993 1.0052 1.0130 1.0042 1.0002 1.0023 0.9981 0.9906 0.9900 0.9960 1.0039 1.0108 1.0068 1.0092 0.9906 1.0076 1.0081 0.9897 0.9894 0.9938 0.9902
dispcorr: -0.033214456 hartree
energy: -3928.147097619560
dipole: -50.45805 49.28272 -1.17533 76.77929 -75.42969 1.34960 -7.64065 8.48936 0.84871
magnitude: 1.98069 au
magnitude: 5.03452 debye
